SHARE
TWEET

Untitled

a guest Jun 19th, 2019 74 Never
Not a member of Pastebin yet? Sign Up, it unlocks many cool features!
  1. make[5]: Entering directory '/home/tapper/openwrt/build_dir/target-mips_24kc_musl/linux-ath79_generic/linux-4.19.52'    
  2.   CALL    scripts/checksyscalls.sh                                                                                      
  3. make: error while loading shared libraries: libc.so.6: failed to map segment from shared object                        
  4. scripts/Makefile.build:544: recipe for target 'drivers/net/ethernet/agere' failed                                      
  5. make[8]: *** [drivers/net/ethernet/agere] Error 127                                                                    
  6. scripts/Makefile.build:544: recipe for target 'drivers/net/ethernet' failed                                            
  7. make[7]: *** [drivers/net/ethernet] Error 2                                                                            
  8. scripts/Makefile.build:544: recipe for target 'drivers/net' failed                                                      
  9. make[6]: *** [drivers/net] Error 2                                                                                      
  10. Makefile:1044: recipe for target 'drivers' failed                                                                      
  11. make[5]: *** [drivers] Error 2                                                                                          
  12. make[5]: Leaving directory '/home/tapper/openwrt/build_dir/target-mips_24kc_musl/linux-ath79_generic/linux-4.19.52'    
  13. Makefile:19: recipe for target '/home/tapper/openwrt/build_dir/target-mips_24kc_musl/linux-ath79_generic/linux-4.19.52/.
  14. modules' failed                                                                                                        
  15. make[4]: *** [/home/tapper/openwrt/build_dir/target-mips_24kc_musl/linux-ath79_generic/linux-4.19.52/.modules] Error 2  
  16. make[4]: Leaving directory '/home/tapper/openwrt/target/linux/ath79'                                                    
  17. Makefile:13: recipe for target 'compile' failed                                                                        
  18. make[3]: *** [compile] Error 2                                                                                          
  19. make[3]: Leaving directory '/home/tapper/openwrt/target/linux'                                                          
  20. time: target/linux/compile#1.53#6.31#10.83                                                                              
  21. target/Makefile:23: recipe for target 'target/linux/compile' failed                                                    
  22. make[2]: *** [target/linux/compile] Error 2                                                                            
  23. make[2]: Leaving directory '/home/tapper/openwrt'                                                                      
  24. target/Makefile:18: recipe for target '/home/tapper/openwrt/staging_dir/target-mips_24kc_musl/stamp/.target_compile' fai
  25. led                                                                                                                    
  26. make[1]: *** [/home/tapper/openwrt/staging_dir/target-mips_24kc_musl/stamp/.target_compile] Error 2                    
  27. make[1]: Leaving directory '/home/tapper/openwrt'                                                                      
  28. /home/tapper/openwrt/include/toplevel.mk:216: recipe for target 'world' failed                                          
  29. make: *** [world] Error 2
RAW Paste Data
We use cookies for various purposes including analytics. By continuing to use Pastebin, you agree to our use of cookies as described in the Cookies Policy. OK, I Understand
 
Top