Guest User

Untitled

a guest
Mar 3rd, 2014
60
Never
Not a member of Pastebin yet? Sign Up, it unlocks many cool features!
  1. ➜ minetest-official git:(master) ✗ cmake . -DRUN_IN_PLACE=1 -DCMAKE_BUILD_TYPE=Debug
  2. -- *** Will build version 0.4.9-dev ***
  3. -- IRRLICHT_SOURCE_DIR =
  4. -- IRRLICHT_INCLUDE_DIR = /usr/local/include/irrlicht
  5. -- IRRLICHT_LIBRARY = /usr/local/lib/libIrrlicht.a
  6. -- CURL_INCLUDE_DIR = /usr/include/curl
  7. -- CURL_LIBRARY = /usr/lib/libcurl.dylib
  8. -- CURL_DLL =
  9. -- cURL support enabled
  10. -- GetText disabled
  11. -- Sound enabled
  12. -- Found system sqlite3 header file in /usr/include
  13. -- Found system sqlite3 library /usr/lib/libsqlite3.dylib
  14. -- Using project jsoncpp library
  15. -- LuaJIT library: /usr/local/lib/libluajit-5.1.dylib
  16. -- LuaJIT headers: /usr/local/include/luajit-2.0
  17. -- LuaJIT found, checking for broken versions...
  18. -- LuaJIT version ok
  19. -- Configuring done
  20. -- Generating done
  21. -- Build files have been written to: /Users/adrian/Github/minetest-official
  22. ➜ minetest-official git:(master) ✗ make -j2
  23. [ 0%] Built target jsoncpp
  24. -- *** Detected git version 0.4.9-120-g3e52dd5-dirty ***
  25. [ 0%] Built target GenerateVersion
  26. Scanning dependencies of target minetestserver
  27. Scanning dependencies of target minetest
  28. [ 0%] Building CXX object src/CMakeFiles/minetestserver.dir/jthread/pthread/jsemaphore.cpp.o
  29. /Users/adrian/Github/minetest-official/src/jthread/pthread/jsemaphore.cpp:85:24: error:
  30. use of undeclared identifier 'sem_timedwait'
  31. int sem_wait_retval = sem_timedwait(&m_semaphore,&waittime);
  32. ^
  33. /Users/adrian/Github/minetest-official/src/jthread/pthread/jsemaphore.cpp:457:2: error:
  34. #endif without #if
  35. #endif
  36. ^
  37. 2 errors generated.
  38. make[2]: *** [src/CMakeFiles/minetestserver.dir/jthread/pthread/jsemaphore.cpp.o] Error 1
  39. make[1]: *** [src/CMakeFiles/minetestserver.dir/all] Error 2
  40. make[1]: *** Waiting for unfinished jobs....
  41. [ 0%] [ 0%] Building CXX object src/CMakeFiles/minetest.dir/jthread/pthread/jthread.cpp.o
  42. Building CXX object src/CMakeFiles/minetest.dir/jthread/pthread/jsemaphore.cpp.o
  43. /Users/adrian/Github/minetest-official/src/jthread/pthread/jsemaphore.cpp:85:24: error:
  44. use of undeclared identifier 'sem_timedwait'
  45. int sem_wait_retval = sem_timedwait(&m_semaphore,&waittime);
  46. ^
  47. /Users/adrian/Github/minetest-official/src/jthread/pthread/jsemaphore.cpp:457:2: error:
  48. #endif without #if
  49. #endif
  50. ^
  51. 2 errors generated.
  52. make[2]: *** [src/CMakeFiles/minetest.dir/jthread/pthread/jsemaphore.cpp.o] Error 1
  53. make[2]: *** Waiting for unfinished jobs....
  54. make[1]: *** [src/CMakeFiles/minetest.dir/all] Error 2
  55. make: *** [all] Error 2
  56. ➜ minetest-official git:(master) ✗
RAW Paste Data

Adblocker detected! Please consider disabling it...

We've detected AdBlock Plus or some other adblocking software preventing Pastebin.com from fully loading.

We don't have any obnoxious sound, or popup ads, we actively block these annoying types of ads!

Please add Pastebin.com to your ad blocker whitelist or disable your adblocking software.

×