SHARE
TWEET

error parrotsdk building natives on arch linux

a guest Mar 18th, 2017 56 in 23 days
Not a member of Pastebin yet? Sign Up, it unlocks many cool features!
  1. ----------------------------------------------------------------------
  2. + ALCHEMY_WORKSPACE_DIR = /home/alexandre/Documents/Installation/parrotsdk
  3. + TARGET_PRODUCT = arsdk
  4. + TARGET_PRODUCT_VARIANT = native
  5. + TARGET_OS = linux
  6. + TARGET_OS_FLAVOUR = native
  7. + TARGET_LIBC = native
  8. + TARGET_ARCH = x64
  9. + TARGET_CPU = 
  10. + TARGET_OUT = /home/alexandre/Documents/Installation/parrotsdk/out/arsdk-native
  11. + TARGET_CONFIG_DIR = /home/alexandre/Documents/Installation/parrotsdk/products/arsdk/native/config
  12. + TARGET_CC_PATH = /usr/bin/cc
  13. + TARGET_CC_VERSION = 6.3.1
  14. ----------------------------------------------------------------------
  15. Found 29 makefiles
  16. Prebuilt module ncurses marked as overriden
  17. Prebuilt module ncurses marked as overriden
  18. Found 69 modules
  19. Computing modules dependencies...
  20. Checking modules dependencies...
  21. Generating rules...
  22. Processing rules...
  23. Copy: packages/ARSDKBuildUtils/libraries.xml => out/arsdk-native/build/ARSDKBuildUtils/libraries.xml
  24. Copy: packages/ARSDKBuildUtils/prebuilt.xml => out/arsdk-native/build/ARSDKBuildUtils/prebuilt.xml
  25. Copy: packages/ARSDKBuildUtils/LICENSE.md => out/arsdk-native/build/ARSDKBuildUtils/LICENSE.md
  26. Copy: packages/ARSDKBuildUtils/.gitignore => out/arsdk-native/build/ARSDKBuildUtils/.gitignore
  27. Copy: packages/ARSDKBuildUtils/SDK3Build.py => out/arsdk-native/build/ARSDKBuildUtils/SDK3Build.py
  28. Copy: packages/ARSDKBuildUtils/repos.xml => out/arsdk-native/build/ARSDKBuildUtils/repos.xml
  29. Copy: packages/ARSDKBuildUtils/binaries.xml => out/arsdk-native/build/ARSDKBuildUtils/binaries.xml
  30. Copy: packages/ARSDKBuildUtils/CheckEnv.py => out/arsdk-native/build/ARSDKBuildUtils/CheckEnv.py
  31. Copy: packages/ARSDKBuildUtils/targets.xml => out/arsdk-native/build/ARSDKBuildUtils/targets.xml
  32. Copy: packages/ARSDKBuildUtils/README.md => out/arsdk-native/build/ARSDKBuildUtils/README.md
  33. Copy: packages/ARSDKBuildUtils/Patches/libressl-2.2.1.patch => out/arsdk-native/build/ARSDKBuildUtils/Patches/libressl-2.2.1.patch
  34. Copy: packages/ARSDKBuildUtils/Utils/cleanupSDKRepo.bash => out/arsdk-native/build/ARSDKBuildUtils/Utils/cleanupSDKRepo.bash
  35. Copy: packages/ARSDKBuildUtils/Utils/m4/ARSDK.m4 => out/arsdk-native/build/ARSDKBuildUtils/Utils/m4/ARSDK.m4
  36. Copy: packages/ARSDKBuildUtils/Utils/generateDocIndex.bash => out/arsdk-native/build/ARSDKBuildUtils/Utils/generateDocIndex.bash
  37. Copy: packages/ARSDKBuildUtils/Utils/copyDoc.bash => out/arsdk-native/build/ARSDKBuildUtils/Utils/copyDoc.bash
  38. Copy: packages/ARSDKBuildUtils/Utils/Python/Unix_BuildBinary.py => out/arsdk-native/build/ARSDKBuildUtils/Utils/Python/Unix_BuildBinary.py
  39. Copy: packages/ARSDKBuildUtils/Utils/Python/Common_HandlePrebuiltDep.py => out/arsdk-native/build/ARSDKBuildUtils/Utils/Python/Common_HandlePrebuiltDep.py
  40. Copy: packages/ARSDKBuildUtils/Utils/Python/iOS_HandlePrebuiltDep.py => out/arsdk-native/build/ARSDKBuildUtils/Utils/Python/iOS_HandlePrebuiltDep.py
  41. Copy: packages/ARSDKBuildUtils/Utils/Python/iOS_GenLibraryDoc.py => out/arsdk-native/build/ARSDKBuildUtils/Utils/Python/iOS_GenLibraryDoc.py
  42. Copy: packages/ARSDKBuildUtils/Utils/Python/Android_CreateFiles.py => out/arsdk-native/build/ARSDKBuildUtils/Utils/Python/Android_CreateFiles.py
  43. Copy: packages/ARSDKBuildUtils/Utils/Python/ARFuncs.py => out/arsdk-native/build/ARSDKBuildUtils/Utils/Python/ARFuncs.py
  44. Copy: packages/ARSDKBuildUtils/Utils/Python/Common_GenAutotoolsLibraryDoc.py => out/arsdk-native/build/ARSDKBuildUtils/Utils/Python/Common_GenAutotoolsLibraryDoc.py
  45. Copy: packages/ARSDKBuildUtils/Utils/Python/Android_GenLibraryDoc.py => out/arsdk-native/build/ARSDKBuildUtils/Utils/Python/Android_GenLibraryDoc.py
  46. Copy: packages/ARSDKBuildUtils/Utils/Python/xmlreader.py => out/arsdk-native/build/ARSDKBuildUtils/Utils/Python/xmlreader.py
  47. Copy: packages/ARSDKBuildUtils/Utils/Python/commandLine.py => out/arsdk-native/build/ARSDKBuildUtils/Utils/Python/commandLine.py
  48. Copy: packages/ARSDKBuildUtils/Utils/Python/Common_CheckConfigure.py => out/arsdk-native/build/ARSDKBuildUtils/Utils/Python/Common_CheckConfigure.py
  49. Copy: packages/ARSDKBuildUtils/Utils/Python/Unix_BuildLibrary.py => out/arsdk-native/build/ARSDKBuildUtils/Utils/Python/Unix_BuildLibrary.py
  50. Copy: packages/ARSDKBuildUtils/Utils/Python/iOS_BuildLibrary.py => out/arsdk-native/build/ARSDKBuildUtils/Utils/Python/iOS_BuildLibrary.py
  51. Copy: packages/ARSDKBuildUtils/Utils/Python/Common_BuildConfigureLibrary.py => out/arsdk-native/build/ARSDKBuildUtils/Utils/Python/Common_BuildConfigureLibrary.py
  52. Copy: packages/ARSDKBuildUtils/Utils/Python/Unix_GenLibraryDoc.py => out/arsdk-native/build/ARSDKBuildUtils/Utils/Python/Unix_GenLibraryDoc.py
  53. Copy: packages/ARSDKBuildUtils/Utils/Python/Common_CheckBootstrap.py => out/arsdk-native/build/ARSDKBuildUtils/Utils/Python/Common_CheckBootstrap.py
  54. Copy: packages/ARSDKBuildUtils/Utils/Python/ARSDK_PrebuildActions.py => out/arsdk-native/build/ARSDKBuildUtils/Utils/Python/ARSDK_PrebuildActions.py
  55. Copy: packages/ARSDKBuildUtils/Utils/Python/Java_GenLibraryDoc.py => out/arsdk-native/build/ARSDKBuildUtils/Utils/Python/Java_GenLibraryDoc.py
  56. Copy: packages/ARSDKBuildUtils/Utils/Python/Common_GitUtils.py => out/arsdk-native/build/ARSDKBuildUtils/Utils/Python/Common_GitUtils.py
  57. Copy: packages/ARSDKBuildUtils/Utils/Python/Android_BuildLibrary.py => out/arsdk-native/build/ARSDKBuildUtils/Utils/Python/Android_BuildLibrary.py
  58. Copy: packages/ARSDKBuildUtils/Utils/Python/Common_RemoveVersionsFromSo.py => out/arsdk-native/build/ARSDKBuildUtils/Utils/Python/Common_RemoveVersionsFromSo.py
  59. Copy: packages/ARSDKBuildUtils/Utils/Python/Darwin_RunXcodeBuild.py => out/arsdk-native/build/ARSDKBuildUtils/Utils/Python/Darwin_RunXcodeBuild.py
  60. Copy: packages/ARSDKBuildUtils/Utils/Python/ARCommandsParser.py => out/arsdk-native/build/ARSDKBuildUtils/Utils/Python/ARCommandsParser.py
  61. Copy: packages/ARSDKBuildUtils/Utils/Python/Common_RunAntScript.py => out/arsdk-native/build/ARSDKBuildUtils/Utils/Python/Common_RunAntScript.py
  62. Copy: packages/ARSDKBuildUtils/Utils/updateGitStatus.bash => out/arsdk-native/build/ARSDKBuildUtils/Utils/updateGitStatus.bash
  63. Copy: build/alchemy/scripts/native-wrapper.sh => out/arsdk-native/staging/native-wrapper.sh
  64. Autotools: curl => Unpacking
  65. Autotools: libressl => Unpacking
  66. Autotools: json => Unpacking
  67. Generating out/arsdk-native/build/libARNetwork/autoconf-libARNetwork.h from out/arsdk-native/build/libARNetwork/libARNetwork.config
  68. Gdb wrapper: /home/alexandre/Documents/Installation/parrotsdk/out/arsdk-native/alchemy.gdb
  69. Autotools: libressl => Patching
  70. Applying 0001-libressl-2.2.1-maintainer-mode.patch:
  71. patching file aclocal.m4
  72. patching file apps/Makefile.in
  73. patching file configure
  74. patching file configure.ac
  75. patching file crypto/Makefile.in
  76. patching file include/Makefile.in
  77. patching file include/openssl/Makefile.in
  78. patching file Makefile.in
  79. patching file man/Makefile.in
  80. patching file ssl/Makefile.in
  81. patching file tests/Makefile.in
  82. patching file tls/Makefile.in
  83. Applying 0002-libressl-2.2.1-android-compilation.patch:
  84. patching file crypto/compat/reallocarray.c
  85. patching file include/machine/endian.h
  86. Applying 0003-libressl-2.2.1-ios-compilation.patch:
  87. patching file configure
  88. patching file m4/check-libc.m4
  89. Applying 0004-libressl-2.2.1-armv5.patch:
  90. patching file crypto/modes/modes_lcl.h
  91. Autotools: json => Patching
  92. Applying 0001-json-c-0.9-maintainer-mode.patch:
  93. patching file aclocal.m4
  94. patching file configure
  95. patching file Makefile.in
  96. Applying 0002-json-c-0.9-avoid-version.patch:
  97. patching file Makefile.am
  98. patching file Makefile.in
  99. Applying 0003-json-c-0.9-android-build.patch:
  100. patching file config.sub
  101. Applying 0004-json-c-0.9-aarch64-build.patch:
  102. patching file config.sub
  103. Autotools: curl => Patching
  104. Applying 0001-ARSDK-Allow-mixed-32-64bits-builds.patch:
  105. patching file include/curl/curlrules.h
  106. Applying 0002-ARSDK-Allow-iOS-x86_64-builds-for-simulators.patch:
  107. patching file include/curl/curlrules.h
  108. Applying avoid-version.patch:
  109. patching file lib/Makefile.am
  110. patching file lib/Makefile.in
  111. x64 C: libARSAL <= packages/libARSAL/Sources/ARSAL_Ftw.c
  112. x64 C: libARSAL <= packages/libARSAL/Sources/ARSAL_MD5.c
  113. x64 C: libARSAL <= packages/libARSAL/Sources/ARSAL_MD5_Manager.c
  114. x64 C: libARSAL <= packages/libARSAL/Sources/ARSAL_Mutex.c
  115. x64 C: libARSAL <= packages/libARSAL/Sources/ARSAL_Print.c
  116. x64 C: libARSAL <= packages/libARSAL/Sources/ARSAL_Sem.c
  117. x64 C: libARSAL <= packages/libARSAL/Sources/ARSAL_Socket.c
  118. x64 C: libARSAL <= packages/libARSAL/Sources/ARSAL_Time.c
  119. x64 C: libARSAL <= packages/libARSAL/Sources/ARSAL_Thread.c
  120. x64 C: libARSAL <= packages/libARSAL/Sources/md5.c
  121. x64 C: libARSAL <= packages/libARSAL/gen/Sources/ARSAL_Error.c
  122. x64 C: libpomp <= packages/libpomp/src/pomp_addr.c
  123. x64 C: libpomp <= packages/libpomp/src/pomp_buffer.c
  124. x64 C: libpomp <= packages/libpomp/src/pomp_conn.c
  125. x64 C: libpomp <= packages/libpomp/src/pomp_ctx.c
  126. x64 C: libpomp <= packages/libpomp/src/pomp_decoder.c
  127. x64 C: libpomp <= packages/libpomp/src/pomp_encoder.c
  128. x64 C: libpomp <= packages/libpomp/src/pomp_log.c
  129. x64 C: libpomp <= packages/libpomp/src/pomp_loop.c
  130. x64 C: libpomp <= packages/libpomp/src/pomp_msg.c
  131. x64 C: libpomp <= packages/libpomp/src/pomp_prot.c
  132. x64 C: libpomp <= packages/libpomp/src/pomp_timer.c
  133. x64 C: libmux <= packages/libmux/src/mux.c
  134. x64 C: libmux <= packages/libmux/src/mux_channel.c
  135. x64 C: libmux <= packages/libmux/src/mux_log.c
  136. x64 C: libmux <= packages/libmux/src/mux_queue.c
  137. Autotools: libressl => Configuring
  138. Autotools: json => Configuring
  139. Copy: packages/arsdk-xml/arsdkparser.py => out/arsdk-native/staging-host/usr/lib/arsdkgen/arsdkparser.py
  140. Copy: packages/arsdk-xml/arsdkgen.py => out/arsdk-native/staging-host/usr/lib/arsdkgen/arsdkgen.py
  141. Copy: packages/arsdk-xml/xml/drone_manager.xml => out/arsdk-native/staging-host/usr/lib/arsdkgen/xml/drone_manager.xml
  142. Copy: packages/arsdk-xml/xml/mapper_mini.xml => out/arsdk-native/staging-host/usr/lib/arsdkgen/xml/mapper_mini.xml
  143. Copy: packages/arsdk-xml/xml/ardrone3.xml => out/arsdk-native/staging-host/usr/lib/arsdkgen/xml/ardrone3.xml
  144. Copy: packages/arsdk-xml/xml/powerup.xml => out/arsdk-native/staging-host/usr/lib/arsdkgen/xml/powerup.xml
  145. Copy: packages/arsdk-xml/xml/controller_info.xml => out/arsdk-native/staging-host/usr/lib/arsdkgen/xml/controller_info.xml
  146. Copy: packages/arsdk-xml/xml/followme.xml => out/arsdk-native/staging-host/usr/lib/arsdkgen/xml/followme.xml
  147. Copy: packages/arsdk-xml/xml/skyctrl.xml => out/arsdk-native/staging-host/usr/lib/arsdkgen/xml/skyctrl.xml
  148. Copy: packages/arsdk-xml/xml/mapper.xml => out/arsdk-native/staging-host/usr/lib/arsdkgen/xml/mapper.xml
  149. Copy: packages/arsdk-xml/xml/generic.xml => out/arsdk-native/staging-host/usr/lib/arsdkgen/xml/generic.xml
  150. Copy: packages/arsdk-xml/xml/wifi.xml => out/arsdk-native/staging-host/usr/lib/arsdkgen/xml/wifi.xml
  151. Copy: packages/arsdk-xml/xml/minidrone.xml => out/arsdk-native/staging-host/usr/lib/arsdkgen/xml/minidrone.xml
  152. Copy: packages/arsdk-xml/xml/common.xml => out/arsdk-native/staging-host/usr/lib/arsdkgen/xml/common.xml
  153. Copy: packages/arsdk-xml/xml/jpsumo.xml => out/arsdk-native/staging-host/usr/lib/arsdkgen/xml/jpsumo.xml
  154. Copy: packages/arsdk-xml/xml/rc.xml => out/arsdk-native/staging-host/usr/lib/arsdkgen/xml/rc.xml
  155. Copy: packages/arsdk-xml/xml/debug.xml => out/arsdk-native/staging-host/usr/lib/arsdkgen/xml/debug.xml
  156. Copy: packages/libARSAL/Includes/libARSAL/ARSAL.h => out/arsdk-native/staging/usr/include/libARSAL/ARSAL.h
  157. Copy: packages/libARSAL/Includes/libARSAL/ARSAL_Endianness.h => out/arsdk-native/staging/usr/include/libARSAL/ARSAL_Endianness.h
  158. Copy: packages/libARSAL/Includes/libARSAL/ARSAL_Error.h => out/arsdk-native/staging/usr/include/libARSAL/ARSAL_Error.h
  159. Copy: packages/libARSAL/Includes/libARSAL/ARSAL_Ftw.h => out/arsdk-native/staging/usr/include/libARSAL/ARSAL_Ftw.h
  160. Copy: packages/libARSAL/Includes/libARSAL/ARSAL_MD5_Manager.h => out/arsdk-native/staging/usr/include/libARSAL/ARSAL_MD5_Manager.h
  161. Copy: packages/libARSAL/Includes/libARSAL/ARSAL_Mutex.h => out/arsdk-native/staging/usr/include/libARSAL/ARSAL_Mutex.h
  162. Copy: packages/libARSAL/Includes/libARSAL/ARSAL_Print.h => out/arsdk-native/staging/usr/include/libARSAL/ARSAL_Print.h
  163. Copy: packages/libARSAL/Includes/libARSAL/ARSAL_Sem.h => out/arsdk-native/staging/usr/include/libARSAL/ARSAL_Sem.h
  164. Copy: packages/libARSAL/Includes/libARSAL/ARSAL_Singleton.h => out/arsdk-native/staging/usr/include/libARSAL/ARSAL_Singleton.h
  165. Copy: packages/libARSAL/Includes/libARSAL/ARSAL_Socket.h => out/arsdk-native/staging/usr/include/libARSAL/ARSAL_Socket.h
  166. Copy: packages/libARSAL/Includes/libARSAL/ARSAL_Thread.h => out/arsdk-native/staging/usr/include/libARSAL/ARSAL_Thread.h
  167. Copy: packages/libARSAL/Includes/libARSAL/ARSAL_Time.h => out/arsdk-native/staging/usr/include/libARSAL/ARSAL_Time.h
  168. Copy: packages/ARSDKTools/uthash/src/utarray.h => out/arsdk-native/staging/usr/include/uthash/utarray.h
  169. Copy: packages/ARSDKTools/uthash/src/uthash.h => out/arsdk-native/staging/usr/include/uthash/uthash.h
  170. Copy: packages/ARSDKTools/uthash/src/utlist.h => out/arsdk-native/staging/usr/include/uthash/utlist.h
  171. Copy: packages/ARSDKTools/uthash/src/utstring.h => out/arsdk-native/staging/usr/include/uthash/utstring.h
  172. x64 C: libARNetworkAL <= packages/libARNetworkAL/Sources/ARNETWORKAL_Manager.c
  173. x64 C: libARNetworkAL <= packages/libARNetworkAL/Sources/Wifi/ARNETWORKAL_WifiNetwork.c
  174. x64 C: libARNetworkAL <= packages/libARNetworkAL/Sources/Mux/ARNETWORKAL_MuxNetwork.c
  175. x64 C: libARNetworkAL <= packages/libARNetworkAL/gen/Sources/ARNETWORKAL_Error.c
  176. Copy: packages/mavlink/pymavlink/dialects/v10/__init__.py => out/arsdk-native/staging-host/usr/lib/mavgen/pymavlink/dialects/v10/__init__.py
  177. Copy: packages/mavlink/pymavlink/dialects/__init__.py => out/arsdk-native/staging-host/usr/lib/mavgen/pymavlink/dialects/__init__.py
  178. Copy: packages/mavlink/pymavlink/dialects/v20/__init__.py => out/arsdk-native/staging-host/usr/lib/mavgen/pymavlink/dialects/v20/__init__.py
  179. Copy: packages/mavlink/pymavlink/dialects/v09/__init__.py => out/arsdk-native/staging-host/usr/lib/mavgen/pymavlink/dialects/v09/__init__.py
  180. Copy: packages/mavlink/pymavlink/mavextra.py => out/arsdk-native/staging-host/usr/lib/mavgen/pymavlink/mavextra.py
  181. Copy: packages/mavlink/pymavlink/mavparm.py => out/arsdk-native/staging-host/usr/lib/mavgen/pymavlink/mavparm.py
  182. Copy: packages/mavlink/pymavlink/mavexpression.py => out/arsdk-native/staging-host/usr/lib/mavgen/pymavlink/mavexpression.py
  183. Copy: packages/mavlink/pymavlink/__init__.py => out/arsdk-native/staging-host/usr/lib/mavgen/pymavlink/__init__.py
  184. Copy: packages/mavlink/pymavlink/mavutil.py => out/arsdk-native/staging-host/usr/lib/mavgen/pymavlink/mavutil.py
  185. Copy: packages/mavlink/pymavlink/tools/mavparms.py => out/arsdk-native/staging-host/usr/lib/mavgen/pymavlink/tools/mavparms.py
  186. Copy: packages/mavlink/pymavlink/tools/MPU6KSearch.py => out/arsdk-native/staging-host/usr/lib/mavgen/pymavlink/tools/MPU6KSearch.py
  187. Copy: packages/mavlink/pymavlink/tools/mavsummarize.py => out/arsdk-native/staging-host/usr/lib/mavgen/pymavlink/tools/mavsummarize.py
  188. Copy: packages/mavlink/pymavlink/tools/mavloss.py => out/arsdk-native/staging-host/usr/lib/mavgen/pymavlink/tools/mavloss.py
  189. Copy: packages/mavlink/pymavlink/tools/mavflightmodes.py => out/arsdk-native/staging-host/usr/lib/mavgen/pymavlink/tools/mavflightmodes.py
  190. Copy: packages/mavlink/pymavlink/tools/mavlogdump.py => out/arsdk-native/staging-host/usr/lib/mavgen/pymavlink/tools/mavlogdump.py
  191. Copy: packages/mavlink/pymavlink/tools/mavgen.py => out/arsdk-native/staging-host/usr/lib/mavgen/pymavlink/tools/mavgen.py
  192. Copy: packages/mavlink/pymavlink/tools/mavsigloss.py => out/arsdk-native/staging-host/usr/lib/mavgen/pymavlink/tools/mavsigloss.py
  193. Copy: packages/mavlink/pymavlink/tools/__init__.py => out/arsdk-native/staging-host/usr/lib/mavgen/pymavlink/tools/__init__.py
  194. Copy: packages/mavlink/pymavlink/tools/mavsearch.py => out/arsdk-native/staging-host/usr/lib/mavgen/pymavlink/tools/mavsearch.py
  195. Copy: packages/mavlink/pymavlink/tools/magfit_rotation_gps.py => out/arsdk-native/staging-host/usr/lib/mavgen/pymavlink/tools/magfit_rotation_gps.py
  196. Copy: packages/mavlink/pymavlink/tools/mavgpslag.py => out/arsdk-native/staging-host/usr/lib/mavgen/pymavlink/tools/mavgpslag.py
  197. Copy: packages/mavlink/pymavlink/tools/mavplayback.py => out/arsdk-native/staging-host/usr/lib/mavgen/pymavlink/tools/mavplayback.py
  198. Copy: packages/mavlink/pymavlink/tools/AccelSearch.py => out/arsdk-native/staging-host/usr/lib/mavgen/pymavlink/tools/AccelSearch.py
  199. Copy: packages/mavlink/pymavlink/tools/magfit_rotation_gyro.py => out/arsdk-native/staging-host/usr/lib/mavgen/pymavlink/tools/magfit_rotation_gyro.py
  200. Copy: packages/mavlink/pymavlink/tools/magfit_gps.py => out/arsdk-native/staging-host/usr/lib/mavgen/pymavlink/tools/magfit_gps.py
  201. Copy: packages/mavlink/pymavlink/tools/mavparmdiff.py => out/arsdk-native/staging-host/usr/lib/mavgen/pymavlink/tools/mavparmdiff.py
  202. Copy: packages/mavlink/pymavlink/tools/mavtogpx.py => out/arsdk-native/staging-host/usr/lib/mavgen/pymavlink/tools/mavtogpx.py
  203. Copy: packages/mavlink/pymavlink/tools/magfit_delta.py => out/arsdk-native/staging-host/usr/lib/mavgen/pymavlink/tools/magfit_delta.py
  204. Copy: packages/mavlink/pymavlink/tools/mavkml.py => out/arsdk-native/staging-host/usr/lib/mavgen/pymavlink/tools/mavkml.py
  205. Copy: packages/mavlink/pymavlink/tools/mavflighttime.py => out/arsdk-native/staging-host/usr/lib/mavgen/pymavlink/tools/mavflighttime.py
  206. Copy: packages/mavlink/pymavlink/tools/magfit_motors.py => out/arsdk-native/staging-host/usr/lib/mavgen/pymavlink/tools/magfit_motors.py
  207. Copy: packages/mavlink/pymavlink/tools/mavfft.py => out/arsdk-native/staging-host/usr/lib/mavgen/pymavlink/tools/mavfft.py
  208. Copy: packages/mavlink/pymavlink/tools/magfit.py => out/arsdk-native/staging-host/usr/lib/mavgen/pymavlink/tools/magfit.py
  209. Copy: packages/mavlink/pymavlink/tools/mavtomfile.py => out/arsdk-native/staging-host/usr/lib/mavgen/pymavlink/tools/mavtomfile.py
  210. Copy: packages/mavlink/pymavlink/tools/quaterniontest.py => out/arsdk-native/staging-host/usr/lib/mavgen/pymavlink/tools/quaterniontest.py
  211. Copy: packages/mavlink/pymavlink/tools/mavextract.py => out/arsdk-native/staging-host/usr/lib/mavgen/pymavlink/tools/mavextract.py
  212. Copy: packages/mavlink/pymavlink/tools/mavgpslock.py => out/arsdk-native/staging-host/usr/lib/mavgen/pymavlink/tools/mavgpslock.py
  213. Copy: packages/mavlink/pymavlink/tools/python_array_test_send.py => out/arsdk-native/staging-host/usr/lib/mavgen/pymavlink/tools/python_array_test_send.py
  214. Copy: packages/mavlink/pymavlink/tools/mavgraph.py => out/arsdk-native/staging-host/usr/lib/mavgen/pymavlink/tools/mavgraph.py
  215. Copy: packages/mavlink/pymavlink/tools/mavmission.py => out/arsdk-native/staging-host/usr/lib/mavgen/pymavlink/tools/mavmission.py
  216. Copy: packages/mavlink/pymavlink/tools/python_array_test_recv.py => out/arsdk-native/staging-host/usr/lib/mavgen/pymavlink/tools/python_array_test_recv.py
  217. Copy: packages/mavlink/pymavlink/examples/mavgps.py => out/arsdk-native/staging-host/usr/lib/mavgen/pymavlink/examples/mavgps.py
  218. Copy: packages/mavlink/pymavlink/examples/magtest.py => out/arsdk-native/staging-host/usr/lib/mavgen/pymavlink/examples/magtest.py
  219. Copy: packages/mavlink/pymavlink/examples/__init__.py => out/arsdk-native/staging-host/usr/lib/mavgen/pymavlink/examples/__init__.py
  220. Copy: packages/mavlink/pymavlink/examples/apmsetrate.py => out/arsdk-native/staging-host/usr/lib/mavgen/pymavlink/examples/apmsetrate.py
  221. Copy: packages/mavlink/pymavlink/examples/wptogpx.py => out/arsdk-native/staging-host/usr/lib/mavgen/pymavlink/examples/wptogpx.py
  222. Copy: packages/mavlink/pymavlink/examples/mav2pcap.py => out/arsdk-native/staging-host/usr/lib/mavgen/pymavlink/examples/mav2pcap.py
  223. Copy: packages/mavlink/pymavlink/examples/mav_accel.py => out/arsdk-native/staging-host/usr/lib/mavgen/pymavlink/examples/mav_accel.py
  224. Copy: packages/mavlink/pymavlink/examples/mavtester.py => out/arsdk-native/staging-host/usr/lib/mavgen/pymavlink/examples/mavtester.py
  225. Copy: packages/mavlink/pymavlink/examples/mavtest.py => out/arsdk-native/staging-host/usr/lib/mavgen/pymavlink/examples/mavtest.py
  226. Copy: packages/mavlink/pymavlink/examples/bwtest.py => out/arsdk-native/staging-host/usr/lib/mavgen/pymavlink/examples/bwtest.py
  227. Copy: packages/mavlink/pymavlink/examples/mavtcpsniff.py => out/arsdk-native/staging-host/usr/lib/mavgen/pymavlink/examples/mavtcpsniff.py
  228. Copy: packages/mavlink/pymavlink/generator/mavgen_objc.py => out/arsdk-native/staging-host/usr/lib/mavgen/pymavlink/generator/mavgen_objc.py
  229. Copy: packages/mavlink/pymavlink/generator/mavgen_c.py => out/arsdk-native/staging-host/usr/lib/mavgen/pymavlink/generator/mavgen_c.py
  230. Copy: packages/mavlink/pymavlink/generator/mavparse.py => out/arsdk-native/staging-host/usr/lib/mavgen/pymavlink/generator/mavparse.py
  231. Copy: packages/mavlink/pymavlink/generator/mavgen_wlua.py => out/arsdk-native/staging-host/usr/lib/mavgen/pymavlink/generator/mavgen_wlua.py
  232. Copy: packages/mavlink/pymavlink/generator/C/test/posix/sha256_test.py => out/arsdk-native/staging-host/usr/lib/mavgen/pymavlink/generator/C/test/posix/sha256_test.py
  233. Copy: packages/mavlink/pymavlink/generator/mavgen_cs.py => out/arsdk-native/staging-host/usr/lib/mavgen/pymavlink/generator/mavgen_cs.py
  234. Copy: packages/mavlink/pymavlink/generator/mavgen.py => out/arsdk-native/staging-host/usr/lib/mavgen/pymavlink/generator/mavgen.py
  235. Copy: packages/mavlink/pymavlink/generator/mavgen_python.py => out/arsdk-native/staging-host/usr/lib/mavgen/pymavlink/generator/mavgen_python.py
  236. Copy: packages/mavlink/pymavlink/generator/__init__.py => out/arsdk-native/staging-host/usr/lib/mavgen/pymavlink/generator/__init__.py
  237. Copy: packages/mavlink/pymavlink/generator/mavgen_javascript.py => out/arsdk-native/staging-host/usr/lib/mavgen/pymavlink/generator/mavgen_javascript.py
  238. Copy: packages/mavlink/pymavlink/generator/mavgen_java.py => out/arsdk-native/staging-host/usr/lib/mavgen/pymavlink/generator/mavgen_java.py
  239. Copy: packages/mavlink/pymavlink/generator/lib/minixsv/xsvalXmlIf.py => out/arsdk-native/staging-host/usr/lib/mavgen/pymavlink/generator/lib/minixsv/xsvalXmlIf.py
  240. Copy: packages/mavlink/pymavlink/generator/lib/minixsv/__init__.py => out/arsdk-native/staging-host/usr/lib/mavgen/pymavlink/generator/lib/minixsv/__init__.py
  241. Copy: packages/mavlink/pymavlink/generator/lib/minixsv/xsvalUtils.py => out/arsdk-native/staging-host/usr/lib/mavgen/pymavlink/generator/lib/minixsv/xsvalUtils.py
  242. Copy: packages/mavlink/pymavlink/generator/lib/minixsv/xsvalBase.py => out/arsdk-native/staging-host/usr/lib/mavgen/pymavlink/generator/lib/minixsv/xsvalBase.py
  243. Copy: packages/mavlink/pymavlink/generator/lib/minixsv/xsvalSchema.py => out/arsdk-native/staging-host/usr/lib/mavgen/pymavlink/generator/lib/minixsv/xsvalSchema.py
  244. Copy: packages/mavlink/pymavlink/generator/lib/minixsv/minixsvWrapper.py => out/arsdk-native/staging-host/usr/lib/mavgen/pymavlink/generator/lib/minixsv/minixsvWrapper.py
  245. Copy: packages/mavlink/pymavlink/generator/lib/minixsv/xsvalSimpleTypes.py => out/arsdk-native/staging-host/usr/lib/mavgen/pymavlink/generator/lib/minixsv/xsvalSimpleTypes.py
  246. Copy: packages/mavlink/pymavlink/generator/lib/minixsv/pyxsval.py => out/arsdk-native/staging-host/usr/lib/mavgen/pymavlink/generator/lib/minixsv/pyxsval.py
  247. Copy: packages/mavlink/pymavlink/generator/lib/minixsv/xsvalErrorHandler.py => out/arsdk-native/staging-host/usr/lib/mavgen/pymavlink/generator/lib/minixsv/xsvalErrorHandler.py
  248. Copy: packages/mavlink/pymavlink/generator/lib/__init__.py => out/arsdk-native/staging-host/usr/lib/mavgen/pymavlink/generator/lib/__init__.py
  249. Copy: packages/mavlink/pymavlink/generator/lib/genxmlif/__init__.py => out/arsdk-native/staging-host/usr/lib/mavgen/pymavlink/generator/lib/genxmlif/__init__.py
  250. Copy: packages/mavlink/pymavlink/generator/lib/genxmlif/xmlifBase.py => out/arsdk-native/staging-host/usr/lib/mavgen/pymavlink/generator/lib/genxmlif/xmlifBase.py
  251. Copy: packages/mavlink/pymavlink/generator/lib/genxmlif/xmlifMinidom.py => out/arsdk-native/staging-host/usr/lib/mavgen/pymavlink/generator/lib/genxmlif/xmlifMinidom.py
  252. Copy: packages/mavlink/pymavlink/generator/lib/genxmlif/xmlifElementTree.py => out/arsdk-native/staging-host/usr/lib/mavgen/pymavlink/generator/lib/genxmlif/xmlifElementTree.py
  253. Copy: packages/mavlink/pymavlink/generator/lib/genxmlif/xmliftest.py => out/arsdk-native/staging-host/usr/lib/mavgen/pymavlink/generator/lib/genxmlif/xmliftest.py
  254. Copy: packages/mavlink/pymavlink/generator/lib/genxmlif/xmlifODict.py => out/arsdk-native/staging-host/usr/lib/mavgen/pymavlink/generator/lib/genxmlif/xmlifODict.py
  255. Copy: packages/mavlink/pymavlink/generator/lib/genxmlif/xmlifUtils.py => out/arsdk-native/staging-host/usr/lib/mavgen/pymavlink/generator/lib/genxmlif/xmlifUtils.py
  256. Copy: packages/mavlink/pymavlink/generator/lib/genxmlif/xmlifApi.py => out/arsdk-native/staging-host/usr/lib/mavgen/pymavlink/generator/lib/genxmlif/xmlifApi.py
  257. Copy: packages/mavlink/pymavlink/generator/lib/genxmlif/xmlifDom.py => out/arsdk-native/staging-host/usr/lib/mavgen/pymavlink/generator/lib/genxmlif/xmlifDom.py
  258. Copy: packages/mavlink/pymavlink/generator/lib/genxmlif/xmlif4Dom.py => out/arsdk-native/staging-host/usr/lib/mavgen/pymavlink/generator/lib/genxmlif/xmlif4Dom.py
  259. Copy: packages/mavlink/pymavlink/generator/mavgen_swift.py => out/arsdk-native/staging-host/usr/lib/mavgen/pymavlink/generator/mavgen_swift.py
  260. Copy: packages/mavlink/pymavlink/generator/mavtemplate.py => out/arsdk-native/staging-host/usr/lib/mavgen/pymavlink/generator/mavtemplate.py
  261. Copy: packages/mavlink/pymavlink/generator/mavcrc.py => out/arsdk-native/staging-host/usr/lib/mavgen/pymavlink/generator/mavcrc.py
  262. Copy: packages/mavlink/pymavlink/generator/mavtestgen.py => out/arsdk-native/staging-host/usr/lib/mavgen/pymavlink/generator/mavtestgen.py
  263. Copy: packages/mavlink/pymavlink/setup.py => out/arsdk-native/staging-host/usr/lib/mavgen/pymavlink/setup.py
  264. Copy: packages/mavlink/pymavlink/quaternion.py => out/arsdk-native/staging-host/usr/lib/mavgen/pymavlink/quaternion.py
  265. Copy: packages/mavlink/pymavlink/DFReader.py => out/arsdk-native/staging-host/usr/lib/mavgen/pymavlink/DFReader.py
  266. Copy: packages/mavlink/pymavlink/rotmat.py => out/arsdk-native/staging-host/usr/lib/mavgen/pymavlink/rotmat.py
  267. Copy: packages/mavlink/pymavlink/fgFDM.py => out/arsdk-native/staging-host/usr/lib/mavgen/pymavlink/fgFDM.py
  268. Copy: packages/mavlink/pymavlink/mavwp.py => out/arsdk-native/staging-host/usr/lib/mavgen/pymavlink/mavwp.py
  269. Copy: packages/mavlink/pymavlink/generator/mavschema.xsd => out/arsdk-native/staging-host/usr/lib/mavgen/pymavlink/generator/mavschema.xsd
  270. Copy: packages/mavlink/pymavlink/generator/lib/minixsv/XMLSchema.xsd => out/arsdk-native/staging-host/usr/lib/mavgen/pymavlink/generator/lib/minixsv/XMLSchema.xsd
  271. Copy: packages/mavlink/pymavlink/generator/lib/minixsv/XMLSchema-instance.xsd => out/arsdk-native/staging-host/usr/lib/mavgen/pymavlink/generator/lib/minixsv/XMLSchema-instance.xsd
  272. Copy: packages/mavlink/pymavlink/generator/lib/minixsv/XInclude.xsd => out/arsdk-native/staging-host/usr/lib/mavgen/pymavlink/generator/lib/minixsv/XInclude.xsd
  273. Copy: packages/mavlink/pymavlink/generator/lib/minixsv/xml.xsd => out/arsdk-native/staging-host/usr/lib/mavgen/pymavlink/generator/lib/minixsv/xml.xsd
  274. Copy: packages/mavlink/pymavlink/generator/lib/minixsv/datatypes.xsd => out/arsdk-native/staging-host/usr/lib/mavgen/pymavlink/generator/lib/minixsv/datatypes.xsd
  275. Copy: packages/mavlink/pymavlink/mavnative/mavlink_defaults.h => out/arsdk-native/staging-host/usr/lib/mavgen/pymavlink/mavnative/mavlink_defaults.h
  276. Copy: packages/mavlink/pymavlink/generator/C/include_v0.9/mavlink_types.h => out/arsdk-native/staging-host/usr/lib/mavgen/pymavlink/generator/C/include_v0.9/mavlink_types.h
  277. Copy: packages/mavlink/pymavlink/generator/C/include_v0.9/protocol.h => out/arsdk-native/staging-host/usr/lib/mavgen/pymavlink/generator/C/include_v0.9/protocol.h
  278. Copy: packages/mavlink/pymavlink/generator/C/include_v0.9/checksum.h => out/arsdk-native/staging-host/usr/lib/mavgen/pymavlink/generator/C/include_v0.9/checksum.h
  279. Copy: packages/mavlink/pymavlink/generator/C/include_v0.9/test/version.h => out/arsdk-native/staging-host/usr/lib/mavgen/pymavlink/generator/C/include_v0.9/test/version.h
  280. Copy: packages/mavlink/pymavlink/generator/C/include_v0.9/test/mavlink.h => out/arsdk-native/staging-host/usr/lib/mavgen/pymavlink/generator/C/include_v0.9/test/mavlink.h
  281. Copy: packages/mavlink/pymavlink/generator/C/include_v0.9/test/test.h => out/arsdk-native/staging-host/usr/lib/mavgen/pymavlink/generator/C/include_v0.9/test/test.h
  282. Copy: packages/mavlink/pymavlink/generator/C/include_v0.9/test/testsuite.h => out/arsdk-native/staging-host/usr/lib/mavgen/pymavlink/generator/C/include_v0.9/test/testsuite.h
  283. Copy: packages/mavlink/pymavlink/generator/C/include_v0.9/test/mavlink_msg_test_types.h => out/arsdk-native/staging-host/usr/lib/mavgen/pymavlink/generator/C/include_v0.9/test/mavlink_msg_test_types.h
  284. Copy: packages/mavlink/pymavlink/generator/C/include_v2.0/mavlink_types.h => out/arsdk-native/staging-host/usr/lib/mavgen/pymavlink/generator/C/include_v2.0/mavlink_types.h
  285. Copy: packages/mavlink/pymavlink/generator/C/include_v0.9/mavlink_helpers.h => out/arsdk-native/staging-host/usr/lib/mavgen/pymavlink/generator/C/include_v0.9/mavlink_helpers.h
  286. Copy: packages/mavlink/pymavlink/generator/C/include_v2.0/mavlink_conversions.h => out/arsdk-native/staging-host/usr/lib/mavgen/pymavlink/generator/C/include_v2.0/mavlink_conversions.h
  287. Copy: packages/mavlink/pymavlink/generator/C/include_v2.0/protocol.h => out/arsdk-native/staging-host/usr/lib/mavgen/pymavlink/generator/C/include_v2.0/protocol.h
  288. Copy: packages/mavlink/pymavlink/generator/C/include_v2.0/mavlink_sha256.h => out/arsdk-native/staging-host/usr/lib/mavgen/pymavlink/generator/C/include_v2.0/mavlink_sha256.h
  289. Copy: packages/mavlink/pymavlink/generator/C/include_v2.0/checksum.h => out/arsdk-native/staging-host/usr/lib/mavgen/pymavlink/generator/C/include_v2.0/checksum.h
  290. Copy: packages/mavlink/pymavlink/generator/C/include_v2.0/mavlink_helpers.h => out/arsdk-native/staging-host/usr/lib/mavgen/pymavlink/generator/C/include_v2.0/mavlink_helpers.h
  291. Copy: packages/mavlink/pymavlink/generator/C/include_v2.0/mavlink_get_info.h => out/arsdk-native/staging-host/usr/lib/mavgen/pymavlink/generator/C/include_v2.0/mavlink_get_info.h
  292. Copy: packages/mavlink/pymavlink/generator/C/test/windows/targetver.h => out/arsdk-native/staging-host/usr/lib/mavgen/pymavlink/generator/C/test/windows/targetver.h
  293. Copy: packages/mavlink/pymavlink/generator/C/test/windows/stdafx.h => out/arsdk-native/staging-host/usr/lib/mavgen/pymavlink/generator/C/test/windows/stdafx.h
  294. Copy: packages/mavlink/pymavlink/generator/C/include_v1.0/mavlink_types.h => out/arsdk-native/staging-host/usr/lib/mavgen/pymavlink/generator/C/include_v1.0/mavlink_types.h
  295. Copy: packages/mavlink/pymavlink/generator/C/include_v1.0/mavlink_conversions.h => out/arsdk-native/staging-host/usr/lib/mavgen/pymavlink/generator/C/include_v1.0/mavlink_conversions.h
  296. Copy: packages/mavlink/pymavlink/generator/C/include_v1.0/protocol.h => out/arsdk-native/staging-host/usr/lib/mavgen/pymavlink/generator/C/include_v1.0/protocol.h
  297. Copy: packages/mavlink/pymavlink/generator/C/include_v1.0/checksum.h => out/arsdk-native/staging-host/usr/lib/mavgen/pymavlink/generator/C/include_v1.0/checksum.h
  298. Copy: packages/mavlink/pymavlink/generator/C/include_v1.0/test/version.h => out/arsdk-native/staging-host/usr/lib/mavgen/pymavlink/generator/C/include_v1.0/test/version.h
  299. Copy: packages/mavlink/pymavlink/generator/C/include_v1.0/test/mavlink.h => out/arsdk-native/staging-host/usr/lib/mavgen/pymavlink/generator/C/include_v1.0/test/mavlink.h
  300. Copy: packages/mavlink/pymavlink/generator/C/include_v1.0/test/test.h => out/arsdk-native/staging-host/usr/lib/mavgen/pymavlink/generator/C/include_v1.0/test/test.h
  301. Copy: packages/mavlink/pymavlink/generator/C/include_v1.0/test/testsuite.h => out/arsdk-native/staging-host/usr/lib/mavgen/pymavlink/generator/C/include_v1.0/test/testsuite.h
  302. Copy: packages/mavlink/pymavlink/generator/C/include_v1.0/test/mavlink_msg_test_types.h => out/arsdk-native/staging-host/usr/lib/mavgen/pymavlink/generator/C/include_v1.0/test/mavlink_msg_test_types.h
  303. Copy: packages/mavlink/pymavlink/generator/C/include_v1.0/mavlink_helpers.h => out/arsdk-native/staging-host/usr/lib/mavgen/pymavlink/generator/C/include_v1.0/mavlink_helpers.h
  304. Copy: packages/mavlink/message_definitions/v0.9/minimal.xml => out/arsdk-native/staging-host/usr/lib/mavgen/message_definitions/v0.9/minimal.xml
  305. Copy: packages/mavlink/message_definitions/v0.9/slugs.xml => out/arsdk-native/staging-host/usr/lib/mavgen/message_definitions/v0.9/slugs.xml
  306. Copy: packages/mavlink/message_definitions/v0.9/ualberta.xml => out/arsdk-native/staging-host/usr/lib/mavgen/message_definitions/v0.9/ualberta.xml
  307. Copy: packages/mavlink/message_definitions/v0.9/ardupilotmega.xml => out/arsdk-native/staging-host/usr/lib/mavgen/message_definitions/v0.9/ardupilotmega.xml
  308. Copy: packages/mavlink/message_definitions/v0.9/common.xml => out/arsdk-native/staging-host/usr/lib/mavgen/message_definitions/v0.9/common.xml
  309. Copy: packages/mavlink/message_definitions/v0.9/test.xml => out/arsdk-native/staging-host/usr/lib/mavgen/message_definitions/v0.9/test.xml
  310. Copy: packages/mavlink/message_definitions/v1.0/autoquad.xml => out/arsdk-native/staging-host/usr/lib/mavgen/message_definitions/v1.0/autoquad.xml
  311. Copy: packages/mavlink/message_definitions/v1.0/minimal.xml => out/arsdk-native/staging-host/usr/lib/mavgen/message_definitions/v1.0/minimal.xml
  312. Copy: packages/mavlink/message_definitions/v1.0/slugs.xml => out/arsdk-native/staging-host/usr/lib/mavgen/message_definitions/v1.0/slugs.xml
  313. Copy: packages/mavlink/message_definitions/v1.0/ASLUAV.xml => out/arsdk-native/staging-host/usr/lib/mavgen/message_definitions/v1.0/ASLUAV.xml
  314. Copy: packages/mavlink/message_definitions/v1.0/ualberta.xml => out/arsdk-native/staging-host/usr/lib/mavgen/message_definitions/v1.0/ualberta.xml
  315. Copy: packages/mavlink/message_definitions/v1.0/matrixpilot.xml => out/arsdk-native/staging-host/usr/lib/mavgen/message_definitions/v1.0/matrixpilot.xml
  316. Copy: packages/mavlink/message_definitions/v1.0/ardupilotmega.xml => out/arsdk-native/staging-host/usr/lib/mavgen/message_definitions/v1.0/ardupilotmega.xml
  317. Copy: packages/mavlink/message_definitions/v1.0/parrot.xml => out/arsdk-native/staging-host/usr/lib/mavgen/message_definitions/v1.0/parrot.xml
  318. Copy: packages/mavlink/message_definitions/v1.0/python_array_test.xml => out/arsdk-native/staging-host/usr/lib/mavgen/message_definitions/v1.0/python_array_test.xml
  319. Copy: packages/mavlink/message_definitions/v1.0/paparazzi.xml => out/arsdk-native/staging-host/usr/lib/mavgen/message_definitions/v1.0/paparazzi.xml
  320. Copy: packages/mavlink/message_definitions/v1.0/common.xml => out/arsdk-native/staging-host/usr/lib/mavgen/message_definitions/v1.0/common.xml
  321. Copy: packages/mavlink/message_definitions/v1.0/test.xml => out/arsdk-native/staging-host/usr/lib/mavgen/message_definitions/v1.0/test.xml
  322. SharedLib: libARSAL => out/arsdk-native/build/libARSAL/libarsal.so
  323. StaticLib: libARSAL => out/arsdk-native/build/libARSAL/libarsal.a
  324. Copy: packages/libARNetworkAL/Includes/libARNetworkAL/ARNetworkAL.h => out/arsdk-native/staging/usr/include/libARNetworkAL/ARNetworkAL.h
  325. Copy: packages/libARNetworkAL/Includes/libARNetworkAL/ARNETWORKAL_Error.h => out/arsdk-native/staging/usr/include/libARNetworkAL/ARNETWORKAL_Error.h
  326. Copy: packages/libARNetworkAL/Includes/libARNetworkAL/ARNETWORKAL_Frame.h => out/arsdk-native/staging/usr/include/libARNetworkAL/ARNETWORKAL_Frame.h
  327. Copy: packages/libARNetworkAL/Includes/libARNetworkAL/ARNETWORKAL_Manager.h => out/arsdk-native/staging/usr/include/libARNetworkAL/ARNETWORKAL_Manager.h
  328. SharedLib: libpomp => out/arsdk-native/build/libpomp/libpomp.so
  329. StaticLib: libpomp => out/arsdk-native/build/libpomp/libpomp.a
  330. x64 C: libARNetwork <= packages/libARNetwork/Sources/ARNETWORK_IOBuffer.c
  331. x64 C: libARNetwork <= packages/libARNetwork/Sources/ARNETWORK_IOBufferParam.c
  332. x64 C: libARNetwork <= packages/libARNetwork/Sources/ARNETWORK_Manager.c
  333. x64 C: libARNetwork <= packages/libARNetwork/Sources/ARNETWORK_Receiver.c
  334. x64 C: libARNetwork <= packages/libARNetwork/Sources/ARNETWORK_RingBuffer.c
  335. x64 C: libARNetwork <= packages/libARNetwork/Sources/ARNETWORK_Sender.c
  336. x64 C: libARNetwork <= packages/libARNetwork/gen/Sources/ARNETWORK_Error.c
  337. Copy: out/arsdk-native/build/libARSAL/libarsal.so => out/arsdk-native/staging/usr/lib/libarsal.so
  338. Copy: out/arsdk-native/build/libARSAL/libarsal.a => out/arsdk-native/staging/usr/lib/libarsal.a
  339. x64 C: libARCommands <= packages/libARCommands/Sources/ARCOMMANDS_Version.c
  340. Copy: out/arsdk-native/build/libpomp/libpomp.so => out/arsdk-native/staging/usr/lib/libpomp.so
  341. Copy: out/arsdk-native/build/libpomp/libpomp.a => out/arsdk-native/staging/usr/lib/libpomp.a
  342. Copy: packages/libARNetwork/Includes/libARNetwork/ARNetwork.h => out/arsdk-native/staging/usr/include/libARNetwork/ARNetwork.h
  343. Copy: packages/libARNetwork/Includes/libARNetwork/ARNETWORK_Error.h => out/arsdk-native/staging/usr/include/libARNetwork/ARNETWORK_Error.h
  344. Copy: packages/libARNetwork/Includes/libARNetwork/ARNETWORK_IOBufferParam.h => out/arsdk-native/staging/usr/include/libARNetwork/ARNETWORK_IOBufferParam.h
  345. Copy: packages/libARNetwork/Includes/libARNetwork/ARNETWORK_Manager.h => out/arsdk-native/staging/usr/include/libARNetwork/ARNETWORK_Manager.h
  346. libARMavlink: Generating mavlink files from packages/libARMavlink/message_definitions/parrot.xml
  347. x64 C: libARCommands <= out/arsdk-native/build/libARCommands/gen/Sources/ARCOMMANDS_Generator.c
  348. WARNING: Unable to load XML validator libraries. XML validation will not be performed
  349. Validation skipped for /home/alexandre/Documents/Installation/parrotsdk/packages/libARMavlink/message_definitions/parrot.xml.
  350. Parsing /home/alexandre/Documents/Installation/parrotsdk/packages/libARMavlink/message_definitions/parrot.xml
  351. Validation skipped for /home/alexandre/Documents/Installation/parrotsdk/out/arsdk-native/staging-host/usr/lib/mavgen/pymavlink/generator/../../message_definitions/v1.0/common.xml.
  352. Parsing /home/alexandre/Documents/Installation/parrotsdk/out/arsdk-native/staging-host/usr/lib/mavgen/pymavlink/generator/../../message_definitions/v1.0/common.xml
  353. Ignoring MAVLink2 message SETUP_SIGNING
  354. Note: message GPS_STATUS is longer than 64 bytes long (109 bytes), which can cause fragmentation since many radio modems use 64 bytes as maximum air transfer unit.
  355. Note: message ATTITUDE_QUATERNION_COV is longer than 64 bytes long (76 bytes), which can cause fragmentation since many radio modems use 64 bytes as maximum air transfer unit.
  356. Note: message GLOBAL_POSITION_INT_COV is longer than 64 bytes long (193 bytes), which can cause fragmentation since many radio modems use 64 bytes as maximum air transfer unit.
  357. Note: message LOCAL_POSITION_NED_COV is longer than 64 bytes long (237 bytes), which can cause fragmentation since many radio modems use 64 bytes as maximum air transfer unit.
  358. Note: message HIGHRES_IMU is longer than 64 bytes long (70 bytes), which can cause fragmentation since many radio modems use 64 bytes as maximum air transfer unit.
  359. Note: message HIL_SENSOR is longer than 64 bytes long (72 bytes), which can cause fragmentation since many radio modems use 64 bytes as maximum air transfer unit.
  360. Note: message SIM_STATE is longer than 64 bytes long (92 bytes), which can cause fragmentation since many radio modems use 64 bytes as maximum air transfer unit.
  361. Note: message FILE_TRANSFER_PROTOCOL is longer than 64 bytes long (262 bytes), which can cause fragmentation since many radio modems use 64 bytes as maximum air transfer unit.
  362. Note: message HIL_STATE_QUATERNION is longer than 64 bytes long (72 bytes), which can cause fragmentation since many radio modems use 64 bytes as maximum air transfer unit.
  363. Note: message LOG_DATA is longer than 64 bytes long (105 bytes), which can cause fragmentation since many radio modems use 64 bytes as maximum air transfer unit.
  364. Note: message GPS_INJECT_DATA is longer than 64 bytes long (121 bytes), which can cause fragmentation since many radio modems use 64 bytes as maximum air transfer unit.
  365. Note: message SERIAL_CONTROL is longer than 64 bytes long (87 bytes), which can cause fragmentation since many radio modems use 64 bytes as maximum air transfer unit.
  366. Note: message ENCAPSULATED_DATA is longer than 64 bytes long (263 bytes), which can cause fragmentation since many radio modems use 64 bytes as maximum air transfer unit.
  367. Note: message RESOURCE_REQUEST is longer than 64 bytes long (251 bytes), which can cause fragmentation since many radio modems use 64 bytes as maximum air transfer unit.
  368. Note: message FOLLOW_TARGET is longer than 64 bytes long (101 bytes), which can cause fragmentation since many radio modems use 64 bytes as maximum air transfer unit.
  369. Note: message CONTROL_SYSTEM_STATE is longer than 64 bytes long (108 bytes), which can cause fragmentation since many radio modems use 64 bytes as maximum air transfer unit.
  370. Note: message AUTOPILOT_VERSION is longer than 64 bytes long (68 bytes), which can cause fragmentation since many radio modems use 64 bytes as maximum air transfer unit.
  371. Note: message GPS_RTCM_DATA is longer than 64 bytes long (190 bytes), which can cause fragmentation since many radio modems use 64 bytes as maximum air transfer unit.
  372. Note: message V2_EXTENSION is longer than 64 bytes long (262 bytes), which can cause fragmentation since many radio modems use 64 bytes as maximum air transfer unit.
  373. Merged enum MAV_CMD
  374. Found 132 MAVLink message types in 2 XML files
  375. Generating C implementation in directory /home/alexandre/Documents/Installation/parrotsdk/out/arsdk-native/build/libARMavlink/generated/mavlink/parrot
  376. Generating C implementation in directory /home/alexandre/Documents/Installation/parrotsdk/out/arsdk-native/build/libARMavlink/generated/mavlink/common
  377. [I] Starting task 'build-sample'
  378. [I] Starting task 'build-sdk'
  379. [I] In '/home/alexandre/Documents/Installation/parrotsdk': ALCHEMY_TARGET_CONFIG_DIR="/home/alexandre/Documents/Installation/parrotsdk/products/arsdk/native/config" ALCHEMY_TARGET_OUT="/home/alexandre/Documents/Installation/parrotsdk/out/arsdk-native" ALCHEMY_TARGET_PRODUCT="arsdk" ALCHEMY_TARGET_PRODUCT_VARIANT="native" ALCHEMY_TARGET_SCAN_ADD_DIRS=" /home/alexandre/Documents/Installation/parrotsdk/packages" ALCHEMY_TARGET_SCAN_PRUNE_DIRS=" /home/alexandre/Documents/Installation/parrotsdk" ALCHEMY_USE_COLORS="1" ALCHEMY_WORKSPACE_DIR="/home/alexandre/Documents/Installation/parrotsdk" PARROT_BUILD_PROP_GROUP="drones" PARROT_BUILD_PROP_PRODUCT="arsdk" PARROT_BUILD_PROP_PROJECT="arsdk" PARROT_BUILD_PROP_UID="arsdk-native-0.0.0-20170318-1456" PARROT_BUILD_PROP_VARIANT="native" PARROT_BUILD_PROP_VERSION="0.0.0" /home/alexandre/Documents/Installation/parrotsdk/build/alchemy/scripts/alchemake -j4 all
  380. Scanning /home/alexandre/Documents/Installation/parrotsdk/packages for makefiles...
  381.   File "/home/alexandre/Documents/Installation/parrotsdk/packages/arsdk-xml/arsdkgen.py", line 51
  382.     os.makedirs(options.outdir, 0755)
  383.                                    ^
  384. SyntaxError: invalid token
  385.   File "/home/alexandre/Documents/Installation/parrotsdk/packages/arsdk-xml/arsdkgen.py", line 51
  386.     os.makedirs(options.outdir, 0755)
  387.                                    ^
  388. SyntaxError: invalid token
  389.   File "/home/alexandre/Documents/Installation/parrotsdk/packages/arsdk-xml/arsdkgen.py", line 51
  390.     os.makedirs(options.outdir, 0755)
  391.                                    ^
  392. SyntaxError: invalid token
  393. cc: error: out/arsdk-native/build/libARCommands/gen/Sources/ARCOMMANDS_Generator.c: No
  394. such file or directory
  395. cc: fatal error: no input files
  396. compilation terminated.
  397. cc: error: out/arsdk-native/build/libARCommands/gen/Sources/ARCOMMANDS_Decoder.c: No such file or directory
  398. make: *** [/home/alexandre/Documents/Installation/parrotsdk/build/alchemy/classes/BINARY/rules.mk:115: /home/alexandre/Documents/Installation/parrotsdk/out/arsdk-native/build/libARCommands/obj/gen/Sources/ARCOMMANDS_Generator.c.o] Error 1
  399.  
  400. MAKE ERROR DETECTED
  401. [E] Task 'build-sdk' failed (Command failed (returncode=254))
RAW Paste Data
Top