SHARE
TWEET

Untitled

a guest Feb 6th, 2012 60 Never
  1. ==> Starting make...
  2. ==> patching the e17 trash module
  3. patching file src/e_mod_main.c
  4. Hunk #1 succeeded at 55 with fuzz 2 (offset 9 lines).
  5. Hunk #2 FAILED at 242.
  6. Hunk #3 FAILED at 259.
  7. 2 out of 3 hunks FAILED -- saving rejects to file src/e_mod_main.c.rej
  8. ==> ERROR: A failure occurred in build().
  9.     Aborting...
  10. ==> ERROR: Makepkg was unable to build e17-module-trash.
  11. ==> Restart building e17-module-trash ? [y/N]
  12. ==> -----------------------------------------
  13. ==>
  14. ==> WARNING: Following packages have not been installed:
  15.     e17-module-trash
RAW Paste Data
Top