Want more features on Pastebin? Sign Up, it's FREE!

Arch Firefox-kde-opensuse build failure

By: egeerardyn on Aug 26th, 2012  |  syntax: None  |  size: 2.51 KB  |  views: 52  |  expires: Never
download  |  raw  |  embed  |  report abuse  |  print
Text below is selected. Please press Ctrl+C to copy to your clipboard. (⌘+C on Mac)
  1. [snip]
  2. bin/components/dom_svg.xpt
  3. bin/components/dom_smil.xpt
  4. Error: package error or possible missing or unnecessary file: bin/libfreebl3.so (package-manifest, 400).
  5. Error: package error or possible missing or unnecessary file: bin/libnss3.so (package-manifest, 401).
  6. Error: package error or possible missing or unnecessary file: bin/libnssckbi.so (package-manifest, 402).
  7. Error: package error or possible missing or unnecessary file: bin/libnssdbm3.so (package-manifest, 403).
  8. Error: package error or possible missing or unnecessary file: bin/libnssutil3.so (package-manifest, 404).
  9. Error: package error or possible missing or unnecessary file: bin/libsmime3.so (package-manifest, 405).
  10. Error: package error or possible missing or unnecessary file: bin/libsoftokn3.so (package-manifest, 406).
  11. Error: package error or possible missing or unnecessary file: bin/libssl3.so (package-manifest, 407).
  12. OthersOverlay.xul
  13. serverCrlNextupdate.js
  14. certerror.js
  15. changepassword.xul
  16. pref-crlupdate.js
  17. resetpassword.xul
  18. pref-crlupdate.xul
  19. choosetoken.js
  20. OrphanOverlay.xul
  21. deletecert.js
  22. editcacert.xul
  23. crlImportDialog.js
  24. MineOverlay.xul
  25. WebSitesOverlay.xul
  26. CAOverlay.xul
  27. crlImportDialog.xul
  28. certpicker.xul
  29. protectedAuth.xul
  30. resetpassword.js
  31. crlManager.js
  32. getp12password.xul
  33. editemailcert.xul
  34. clientauthask.xul
  35. editsslcert.xul
  36. editcerts.js
  37. password.js
  38. createCertInfo.js
  39. certerror.xul
  40. load_device.xul
  41. downloadcert.js
  42. device_manager.js
  43. certManager.js
  44. viewCertDetails.xul
  45. certpicker.js
  46. choosetoken.xul
  47. exceptionDialog.xul
  48. clientauthask.js
  49. setp12password.xul
  50. serverCrlNextupdate.xul
  51. crlManager.xul
  52. formsigning.xul
  53. escrowWarn.xul
  54. certViewer.xul
  55. escrowWarn.js
  56. cacertexists.xul
  57. downloadcert.xul
  58. createCertInfo.xul
  59. certManager.xul
  60. viewCertDetails.js
  61. deletecert.xul
  62. device_manager.xul
  63. exceptionDialog.js
  64. pippki.js
  65. protectedAuth.js
  66. formsigning.js
  67. getpassword.xul
  68. certDump.xul
  69. bin/chrome/pippki.manifest
  70. bin/components/pipboot.xpt
  71. bin/components/pipnss.xpt
  72. bin/components/pippki.xpt
  73. Error: found error(s) while packaging, see above for details.
  74. make[3]: *** [stage-package] Error 255
  75. make[3]: Leaving directory `/media/LinuxELEC/tmp/aur-firefox-kde-opensuse/src/mozilla-release/ff-pgo/browser/installer'
  76. make[2]: *** [default] Error 2
  77. make[2]: Leaving directory `/media/LinuxELEC/tmp/aur-firefox-kde-opensuse/src/mozilla-release/ff-pgo/browser/installer'
  78. make[1]: *** [package] Error 2
  79. make[1]: Leaving directory `/media/LinuxELEC/tmp/aur-firefox-kde-opensuse/src/mozilla-release/ff-pgo'
  80. make: *** [profiledbuild] Error 2
clone this paste RAW Paste Data