Want more features on Pastebin? Sign Up, it's FREE!
Guest

Csound QT "make" errors

By: esteband on May 20th, 2014  |  syntax: None  |  size: 1.35 KB  |  views: 164  |  expires: Never
download  |  raw  |  embed  |  report abuse  |  print
Text below is selected. Please press Ctrl+C to copy to your clipboard. (⌘+C on Mac)
  1. steve@steveaudio:~/source/qutecsound-code$ make
  2. g++ -c -pipe -O2 -D_REENTRANT -Wall -W -DQT_WEBKIT -DCSOUND6 -DQCS_RTMIDI -D__LINUX_ALSASEQ__ -D__LINUX_ALSA__ -DQT_NO_DEBUG -DQT_XML_LIB -DQT_GUI_LIB -DQT_CORE_LIB -DQT_SHARED -I/usr/share/qt4/mkspecs/linux-g++ -I. -I/usr/include/qt4/QtCore -I/usr/include/qt4/QtGui -I/usr/include/qt4/QtXml -I/usr/include/qt4 -Irtmidi-2.1.0 -I/usr/local/include/csound -I/usr/include -Ibuild/moc -Ibuild/ui -o build/floats/obj/configdialog.o src/configdialog.cpp
  3. src/configdialog.cpp: In constructor ‘ConfigDialog::ConfigDialog(CsoundQt*, Options*, ConfigLists*)’:
  4. src/configdialog.cpp:79:16: error: expected type-specifier before ‘RtError’
  5. src/configdialog.cpp:79:24: error: expected ‘)’ before ‘&’ token
  6. src/configdialog.cpp:79:24: error: expected ‘{’ before ‘&’ token
  7. src/configdialog.cpp:79:25: error: ‘error’ was not declared in this scope
  8. src/configdialog.cpp:79:30: error: expected ‘;’ before ‘)’ token
  9. src/configdialog.cpp:90:9: error: expected type-specifier before ‘RtError’
  10. src/configdialog.cpp:90:17: error: expected ‘)’ before ‘&’ token
  11. src/configdialog.cpp:90:17: error: expected ‘{’ before ‘&’ token
  12. src/configdialog.cpp:90:23: error: expected ‘;’ before ‘)’ token
  13. make: *** [build/floats/obj/configdialog.o] Error 1
  14. steve@steveaudio:~/source/qutecsound-code$
clone this paste RAW Paste Data