Want more features on Pastebin? Sign Up, it's FREE!
Guest

hybrid_wl make

By: a guest on Sep 27th, 2013  |  syntax: None  |  size: 1.85 KB  |  views: 4  |  expires: Never
download  |  raw  |  embed  |  report abuse  |  print
Text below is selected. Please press Ctrl+C to copy to your clipboard. (⌘+C on Mac)
  1. /usr/local/src/hybrid_wl-# make
  2. KBUILD_NOPEDANTIC=1 make -C /lib/modules/`uname -r`/build M=`pwd`
  3. make[1]: Entering directory `/usr/src/linux-3.10.12'
  4. CFG80211 API is prefered for this kernel version
  5. Using CFG80211 API
  6.   CC [M]  /usr/local/src/hybrid_wl/src/wl/sys/wl_linux.o
  7. /usr/local/src/hybrid_wl/src/wl/sys/wl_linux.c: In function 'wl_tkip_printstats':
  8. /usr/local/src/hybrid_wl/src/wl/sys/wl_linux.c:3246:7: warning: passing argument 1 of 'wl->tkipmodops->print_stats' from incompatible pointer type [enabled by default]
  9. /usr/local/src/hybrid_wl/src/wl/sys/wl_linux.c:3246:7: note: expected 'struct seq_file *' but argument is of type 'char *'
  10. /usr/local/src/hybrid_wl/src/wl/sys/wl_linux.c:3249:4: warning: passing argument 1 of 'wl->tkipmodops->print_stats' from incompatible pointer type [enabled by default]
  11. /usr/local/src/hybrid_wl/src/wl/sys/wl_linux.c:3249:4: note: expected 'struct seq_file *' but argument is of type 'char *'
  12. /usr/local/src/hybrid_wl/src/wl/sys/wl_linux.c: In function 'wl_reg_proc_entry':
  13. /usr/local/src/hybrid_wl/src/wl/sys/wl_linux.c:3470:2: error: implicit declaration of function 'create_proc_entry' [-Werror=implicit-function-declaration]
  14. /usr/local/src/hybrid_wl/src/wl/sys/wl_linux.c:3470:22: warning: assignment makes pointer from integer without a cast [enabled by default]
  15. /usr/local/src/hybrid_wl/src/wl/sys/wl_linux.c:3475:16: error: dereferencing pointer to incomplete type
  16. /usr/local/src/hybrid_wl/src/wl/sys/wl_linux.c:3476:16: error: dereferencing pointer to incomplete type
  17. /usr/local/src/hybrid_wl/src/wl/sys/wl_linux.c:3477:16: error: dereferencing pointer to incomplete type
  18. cc1: some warnings being treated as errors
  19. make[2]: *** [/usr/local/src/hybrid_wl/src/wl/sys/wl_linux.o] Error 1
  20. make[1]: *** [_module_/usr/local/src/hybrid_wl] Error 2
  21. make[1]: Leaving directory `/usr/src/linux-3.10.12'
  22. make: *** [all] Error 2
clone this paste RAW Paste Data