Want more features on Pastebin? Sign Up, it's FREE!
Guest

Arch Linux AUR fgrun link error x86_64

By: a guest on Apr 25th, 2012  |  syntax: None  |  size: 9.15 KB  |  views: 61  |  expires: Never
download  |  raw  |  embed  |  report abuse  |  print
Text below is selected. Please press Ctrl+C to copy to your clipboard. (⌘+C on Mac)
  1. ==> Making package: fgrun 1.6.1-1 (Wed Apr 25 11:05:11 PDT 2012)
  2. ==> Checking runtime dependencies...
  3. ==> Checking buildtime dependencies...
  4. ==> Retrieving Sources...
  5.   -> Downloading fgrun-1.6.1.tar.bz2...
  6.   % Total    % Received % Xferd  Average Speed   Time    Time     Time  Current
  7.                                  Dload  Upload   Total   Spent    Left  Speed
  8.   0     0    0     0    0     0      0      0 --:--:-- --:--:-- --:--:--     0
  9.   0     0    0     0    0     0      0      0 --:--:-- --:--:-- --:--:--     0
  10. 100  184k  100  184k    0     0  95713      0  0:00:01  0:00:01 --:--:--  199k
  11. ==> Validating source files with sha256sums...
  12.     fgrun-1.6.1.tar.bz2 ... Passed
  13. ==> Extracting Sources...
  14.   -> Extracting fgrun-1.6.1.tar.bz2 with bsdtar
  15. ==> Entering fakeroot environment...
  16. ==> Starting build()...
  17. -- The C compiler identification is GNU 4.7.0
  18. -- The CXX compiler identification is GNU 4.7.0
  19. -- Check for working C compiler: /usr/bin/gcc
  20. -- Check for working C compiler: /usr/bin/gcc -- works
  21. -- Detecting C compiler ABI info
  22. -- Detecting C compiler ABI info - done
  23. -- Check for working CXX compiler: /usr/bin/c++
  24. -- Check for working CXX compiler: /usr/bin/c++ -- works
  25. -- Detecting CXX compiler ABI info
  26. -- Detecting CXX compiler ABI info - done
  27. -- version is 1 dot 6 dot 1
  28. -- ignoring: \\.svn;Makefile.am;~$;
  29. -- Boost version: 1.49.0
  30. -- Found ZLIB: /usr/lib/libz.so (found version "1.2.6")
  31. -- Looking for XOpenDisplay in /usr/lib/libX11.so;/usr/lib/libXext.so
  32. -- Looking for XOpenDisplay in /usr/lib/libX11.so;/usr/lib/libXext.so - found
  33. -- Looking for gethostbyname
  34. -- Looking for gethostbyname - found
  35. -- Looking for connect
  36. -- Looking for connect - found
  37. -- Looking for remove
  38. -- Looking for remove - found
  39. -- Looking for shmat
  40. -- Looking for shmat - found
  41. -- Looking for IceConnectionNumber in ICE
  42. -- Looking for IceConnectionNumber in ICE - found
  43. -- Found X11: /usr/lib/libX11.so
  44. -- Found OpenGL: /usr/lib/libGL.so  
  45. -- Found FLTK: /usr/lib/libfltk_images.so;/usr/lib/libfltk_forms.so;/usr/lib/libfltk_gl.so;/usr/lib/libGL.so;/usr/lib/libfltk.so  
  46. -- Found osgText: /usr/lib/libosgText.so  
  47. -- Found osgDB: /usr/lib/libosgDB.so  
  48. -- Found osgParticle: /usr/lib/libosgParticle.so  
  49. -- Found osgUtil: /usr/lib/libosgUtil.so  
  50. -- Found osgViewer: /usr/lib/libosgViewer.so  
  51. -- Found osgGA: /usr/lib/libosgGA.so  
  52. -- Found osg: /usr/lib/libosg.so  
  53. -- Found OpenThreads: /usr/lib/libOpenThreads.so  
  54. -- Found OpenSceneGraph: /usr/lib/libosgText.so;/usr/lib/libosgDB.so;/usr/lib/libosgParticle.so;/usr/lib/libosgUtil.so;/usr/lib/libosgViewer.so;/usr/lib/libosgGA.so;/usr/lib/libosg.so;/usr/lib/libOpenThreads.so (Required is at least version "2.8.1")
  55. -- Looking for include file pthread.h
  56. -- Looking for include file pthread.h - found
  57. -- Looking for pthread_create
  58. -- Looking for pthread_create - not found.
  59. -- Looking for pthread_create in pthreads
  60. -- Looking for pthread_create in pthreads - not found
  61. -- Looking for pthread_create in pthread
  62. -- Looking for pthread_create in pthread - found
  63. -- Found Threads: TRUE  
  64. -- looking for static Simgear libraries
  65. -- Looking for clock_gettime
  66. -- Looking for clock_gettime - not found
  67. -- Looking for clock_gettime in rt
  68. -- Looking for clock_gettime in rt - found
  69. -- looking for version: 2.2.0
  70. -- Performing Test SIMGEAR_VERSION_OK
  71. -- Performing Test SIMGEAR_VERSION_OK - Success
  72. -- Found SimGear: optimized;/usr/lib/libsgtsync.a;debug;/usr/lib/libsgtsync.a;optimized;/usr/lib/libsgephem.a;debug;/usr/lib/libsgephem.a;optimized;/usr/lib/libsgsky.a;debug;/usr/lib/libsgsky.a;optimized;/usr/lib/libsgmaterial.a;debug;/usr/lib/libsgmaterial.a;optimized;/usr/lib/libsgtgdb.a;debug;/usr/lib/libsgtgdb.a;optimized;/usr/lib/libsgmodel.a;debug;/usr/lib/libsgmodel.a;optimized;/usr/lib/libsgscreen.a;debug;/usr/lib/libsgscreen.a;optimized;/usr/lib/libsgbvh.a;debug;/usr/lib/libsgbvh.a;optimized;/usr/lib/libsgutil.a;debug;/usr/lib/libsgutil.a;optimized;/usr/lib/libsgsound.a;debug;/usr/lib/libsgsound.a;optimized;/usr/lib/libsgenvironment.a;debug;/usr/lib/libsgenvironment.a;optimized;/usr/lib/libsgnasal.a;debug;/usr/lib/libsgnasal.a;optimized;/usr/lib/libsgbucket.a;debug;/usr/lib/libsgbucket.a;optimized;/usr/lib/libsgroute.a;debug;/usr/lib/libsgroute.a;optimized;/usr/lib/libsgtiming.a;debug;/usr/lib/libsgtiming.a;optimized;/usr/lib/libsgio.a;debug;/usr/lib/libsgio.a;optimized;/usr/lib/libsgserial.a;debug;/usr/lib/libsgserial.a;optimized;/usr/lib/libsgmath.a;debug;/usr/lib/libsgmath.a;optimized;/usr/lib/libsgprops.a;debug;/usr/lib/libsgprops.a;optimized;/usr/lib/libsgstructure.a;debug;/usr/lib/libsgstructure.a;optimized;/usr/lib/libsgxml.a;debug;/usr/lib/libsgxml.a;optimized;/usr/lib/libsgmisc.a;debug;/usr/lib/libsgmisc.a;optimized;/usr/lib/libsgthreads.a;debug;/usr/lib/libsgthreads.a;optimized;/usr/lib/libsgdebug.a;debug;/usr/lib/libsgdebug.a;optimized;/usr/lib/libsgmagvar.a;debug;/usr/lib/libsgmagvar.a (Required is at least version "2.2.0")
  73. -- Found Gettext: /usr/bin/msgmerge (found version "0.18.1")
  74. -- Looking for unistd.h
  75. -- Looking for unistd.h - found
  76. -- Looking for stdlib.h
  77. -- Looking for stdlib.h - found
  78. -- Looking for sys/wait.h
  79. -- Looking for sys/wait.h - found
  80. -- Looking for termios.h
  81. -- Looking for termios.h - found
  82. -- Looking for pty.h
  83. -- Looking for pty.h - found
  84. -- Looking for utmp.h
  85. -- Looking for utmp.h - found
  86. -- Looking for fcntl.h
  87. -- Looking for fcntl.h - found
  88. -- Looking for string.h
  89. -- Looking for string.h - found
  90. -- Looking for openpty
  91. -- Looking for openpty - not found
  92. -- Looking for openpty
  93. -- Looking for openpty - found
  94. -- Looking for login_tty
  95. -- Looking for login_tty - found
  96. -- Looking for _getpty
  97. -- Looking for _getpty - not found
  98. -- Found X11_Xinerama...
  99. -- Found X11_Xft...
  100. -- Using FLTK_LIBRARIES for fgrun: /usr/lib/libfltk_images.so;/usr/lib/libfltk_forms.so;/usr/lib/libfltk_gl.so;/usr/lib/libGL.so;/usr/lib/libfltk.so;/usr/lib/libSM.so;/usr/lib/libICE.so;/usr/lib/libX11.so;/usr/lib/libXext.so;/usr/lib/libm.so;/usr/lib/libXinerama.so;/usr/lib/libXft.so
  101. -- Performing Test HAVE_FLTK_1_3
  102. -- Performing Test HAVE_FLTK_1_3 - Failed
  103. -- Configuring done
  104. -- Generating done
  105. -- Build files have been written to: /home/beej/aur/build/fgrun/src/fgrun-1.6.1
  106. Scanning dependencies of target translations_1
  107. Scanning dependencies of target fgrun
  108. [  3%] [  7%] [ 11%] [ 15%] Generating de.gmo
  109. Generating fr.gmo
  110. Generating es.gmo
  111. Generating it.gmo
  112. [ 19%] Building CXX object src/CMakeFiles/fgrun.dir/wizard_funcs.cxx.o
  113. [ 23%] [ 26%] [ 30%] [ 34%] Building CXX object src/CMakeFiles/fgrun.dir/advanced_funcs.cxx.o
  114. Generating nl.gmo
  115. Generating pl.gmo
  116. Generating pt.gmo
  117. [ 42%] [ 42%] [ 42%] Built target translations_1
  118. Building CXX object src/CMakeFiles/fgrun.dir/AirportTable.cxx.o
  119. Building CXX object src/CMakeFiles/fgrun.dir/AirportBrowser.cxx.o
  120. [ 46%] Building CXX object src/CMakeFiles/fgrun.dir/Fl_Table.cxx.o
  121. [ 50%] Building CXX object src/CMakeFiles/fgrun.dir/Fl_Table_Row.cxx.o
  122. [ 53%] Building CXX object src/CMakeFiles/fgrun.dir/Fl_OSG.cxx.o
  123. [ 57%] Building CXX object src/CMakeFiles/fgrun.dir/Fl_Heading_Dial.cxx.o
  124. [ 61%] Building CXX object src/CMakeFiles/fgrun.dir/main.cxx.o
  125. [ 65%] Building CXX object src/CMakeFiles/fgrun.dir/io.cxx.o
  126. [ 69%] Building CXX object src/CMakeFiles/fgrun.dir/fgfsrc.cxx.o
  127. [ 73%] Building CXX object src/CMakeFiles/fgrun.dir/logwin.cxx.o
  128. [ 76%] Building CXX object src/CMakeFiles/fgrun.dir/parkingloader.cxx.o
  129. [ 80%] Building CXX object src/CMakeFiles/fgrun.dir/settings.cxx.o
  130. [ 84%] Building CXX object src/CMakeFiles/fgrun.dir/util.cxx.o
  131. [ 88%] Building CXX object src/CMakeFiles/fgrun.dir/run_posix.cxx.o
  132. [ 92%] Building CXX object src/CMakeFiles/fgrun.dir/fgrun_pty.cxx.o
  133. [ 96%] Building CXX object src/CMakeFiles/fgrun.dir/wizard.cxx.o
  134. [100%] Building CXX object src/CMakeFiles/fgrun.dir/advanced.cxx.o
  135. Linking CXX executable fgrun
  136. `.text._ZN3osg13TemplateArrayINS_5Vec4fELNS_5Array4TypeE11ELi4ELi5126EED2Ev' referenced in section `.text._ZN3osg13TemplateArrayINS_5Vec4fELNS_5Array4TypeE11ELi4ELi5126EED1Ev[_ZN3osg13TemplateArrayINS_5Vec4fELNS_5Array4TypeE11ELi4ELi5126EED1Ev]' of /usr/lib/gcc/x86_64-unknown-linux-gnu/4.7.0/../../../../lib/libsgutil.a(StateAttributeFactory.cxx.o): defined in discarded section `.text._ZN3osg13TemplateArrayINS_5Vec4fELNS_5Array4TypeE11ELi4ELi5126EED2Ev[_ZN3osg13TemplateArrayINS_5Vec4fELNS_5Array4TypeE11ELi4ELi5126EED5Ev]' of /usr/lib/gcc/x86_64-unknown-linux-gnu/4.7.0/../../../../lib/libsgutil.a(StateAttributeFactory.cxx.o)
  137. `.text._ZN3osg13TemplateArrayINS_5Vec3fELNS_5Array4TypeE10ELi3ELi5126EED2Ev' referenced in section `.text._ZN3osg13TemplateArrayINS_5Vec3fELNS_5Array4TypeE10ELi3ELi5126EED1Ev[_ZN3osg13TemplateArrayINS_5Vec3fELNS_5Array4TypeE10ELi3ELi5126EED1Ev]' of /usr/lib/gcc/x86_64-unknown-linux-gnu/4.7.0/../../../../lib/libsgtgdb.a(obj.cxx.o): defined in discarded section `.text._ZN3osg13TemplateArrayINS_5Vec3fELNS_5Array4TypeE10ELi3ELi5126EED2Ev[_ZN3osg13TemplateArrayINS_5Vec3fELNS_5Array4TypeE10ELi3ELi5126EED5Ev]' of /usr/lib/gcc/x86_64-unknown-linux-gnu/4.7.0/../../../../lib/libsgtgdb.a(obj.cxx.o)
  138. collect2: error: ld returned 1 exit status
  139. make[2]: *** [src/fgrun] Error 1
  140. make[1]: *** [src/CMakeFiles/fgrun.dir/all] Error 2
  141. make: *** [all] Error 2
  142. ==> ERROR: A failure occurred in build().
  143.     Aborting...
clone this paste RAW Paste Data