Pastebin launched a little side project called VERYVIRAL.com, check it out ;-) Want more features on Pastebin? Sign Up, it's FREE!
Guest

dev-libs/libunique-3.0.2 build failure

By: Shelnutt2 on Aug 19th, 2011  |  syntax: None  |  size: 87.27 KB  |  views: 41  |  expires: Never
download  |  raw  |  embed  |  report abuse  |  print
Text below is selected. Please press Ctrl+C to copy to your clipboard. (⌘+C on Mac)
  1.  * Package:    dev-libs/libunique-3.0.2
  2.  * Repository: gentoo
  3.  * Maintainer: gnome@gentoo.org
  4.  * USE:        amd64 bindist elibc_glibc introspection kernel_linux multilib userland_GNU
  5.  * FEATURES:   preserve-libs sandbox
  6. >>> Unpacking source...
  7. >>> Unpacking libunique-3.0.2.tar.xz to /var/tmp/portage/dev-libs/libunique-3.0.2/work
  8. >>> Source unpacked in /var/tmp/portage/dev-libs/libunique-3.0.2/work
  9. >>> Preparing source in /var/tmp/portage/dev-libs/libunique-3.0.2/work/libunique-3.0.2 ...
  10.  * Fixing OMF Makefiles ...
  11.  [ ok ]
  12.  * Running elibtoolize in: libunique-3.0.2/
  13.  *   Applying portage-1.2.0.patch ...
  14.  *   Applying sed-1.5.6.patch ...
  15.  *   Applying as-needed-2.2.6.patch ...
  16. >>> Source prepared.
  17. >>> Configuring source in /var/tmp/portage/dev-libs/libunique-3.0.2/work/libunique-3.0.2 ...
  18.  * econf: updating libunique-3.0.2/config.guess with /usr/share/gnuconfig/config.guess
  19.  * econf: updating libunique-3.0.2/config.sub with /usr/share/gnuconfig/config.sub
  20. ./configure --prefix=/usr --build=x86_64-pc-linux-gnu --host=x86_64-pc-linux-gnu --mandir=/usr/share/man --infodir=/usr/share/info --datadir=/usr/share --sysconfdir=/etc --localstatedir=/var/lib --libdir=/usr/lib64 --disable-dependency-tracking --disable-static --disable-maintainer-flags --disable-dbus --enable-introspection --disable-gtk-doc
  21. checking for a BSD-compatible install... /usr/bin/install -c
  22. checking whether build environment is sane... yes
  23. checking for a thread-safe mkdir -p... /bin/mkdir -p
  24. checking for gawk... gawk
  25. checking whether make sets $(MAKE)... yes
  26. checking for style of include used by make... GNU
  27. checking for x86_64-pc-linux-gnu-gcc... x86_64-pc-linux-gnu-gcc
  28. checking whether the C compiler works... yes
  29. checking for C compiler default output file name... a.out
  30. checking for suffix of executables...
  31. checking whether we are cross compiling... no
  32. checking for suffix of object files... o
  33. checking whether we are using the GNU C compiler... yes
  34. checking whether x86_64-pc-linux-gnu-gcc accepts -g... yes
  35. checking for x86_64-pc-linux-gnu-gcc option to accept ISO C89... none needed
  36. checking dependency style of x86_64-pc-linux-gnu-gcc... none
  37. checking whether x86_64-pc-linux-gnu-gcc and cc understand -c and -o together... yes
  38. checking for x86_64-pc-linux-gnu-pkg-config... no
  39. checking for pkg-config... /usr/bin/pkg-config
  40. checking pkg-config is at least version 0.16... yes
  41. checking for GLIB - version >= 2.0.0... yes (version 2.29.17)
  42. checking build system type... x86_64-pc-linux-gnu
  43. checking host system type... x86_64-pc-linux-gnu
  44. checking how to print strings... printf
  45. checking for a sed that does not truncate output... /bin/sed
  46. checking for grep that handles long lines and -e... /bin/grep
  47. checking for egrep... /bin/grep -E
  48. checking for fgrep... /bin/grep -F
  49. checking for ld used by x86_64-pc-linux-gnu-gcc... /usr/x86_64-pc-linux-gnu/bin/ld
  50. checking if the linker (/usr/x86_64-pc-linux-gnu/bin/ld) is GNU ld... yes
  51. checking for BSD- or MS-compatible name lister (nm)... /usr/bin/nm -B
  52. checking the name lister (/usr/bin/nm -B) interface... BSD nm
  53. checking whether ln -s works... yes
  54. checking the maximum length of command line arguments... 1572864
  55. checking whether the shell understands some XSI constructs... yes
  56. checking whether the shell understands "+="... yes
  57. checking how to convert x86_64-pc-linux-gnu file names to x86_64-pc-linux-gnu format... func_convert_file_noop
  58. checking how to convert x86_64-pc-linux-gnu file names to toolchain format... func_convert_file_noop
  59. checking for /usr/x86_64-pc-linux-gnu/bin/ld option to reload object files... -r
  60. checking for x86_64-pc-linux-gnu-objdump... x86_64-pc-linux-gnu-objdump
  61. checking how to recognize dependent libraries... pass_all
  62. checking for x86_64-pc-linux-gnu-dlltool... no
  63. checking for dlltool... no
  64. checking how to associate runtime and link libraries... printf %s\n
  65. checking for x86_64-pc-linux-gnu-ar... x86_64-pc-linux-gnu-ar
  66. checking for archiver @FILE support... @
  67. checking for x86_64-pc-linux-gnu-strip... x86_64-pc-linux-gnu-strip
  68. checking for x86_64-pc-linux-gnu-ranlib... x86_64-pc-linux-gnu-ranlib
  69. checking command to parse /usr/bin/nm -B output from x86_64-pc-linux-gnu-gcc object... ok
  70. checking for sysroot... no
  71. checking for x86_64-pc-linux-gnu-mt... no
  72. checking for mt... no
  73. checking if : is a manifest tool... no
  74. checking how to run the C preprocessor... x86_64-pc-linux-gnu-gcc -E
  75. checking for ANSI C header files... yes
  76. checking for sys/types.h... yes
  77. checking for sys/stat.h... yes
  78. checking for stdlib.h... yes
  79. checking for string.h... yes
  80. checking for memory.h... yes
  81. checking for strings.h... yes
  82. checking for inttypes.h... yes
  83. checking for stdint.h... yes
  84. checking for unistd.h... yes
  85. checking for dlfcn.h... yes
  86. checking for objdir... .libs
  87. checking if x86_64-pc-linux-gnu-gcc supports -fno-rtti -fno-exceptions... no
  88. checking for x86_64-pc-linux-gnu-gcc option to produce PIC... -fPIC -DPIC
  89. checking if x86_64-pc-linux-gnu-gcc PIC flag -fPIC -DPIC works... yes
  90. checking if x86_64-pc-linux-gnu-gcc static flag -static works... yes
  91. checking if x86_64-pc-linux-gnu-gcc supports -c -o file.o... yes
  92. checking if x86_64-pc-linux-gnu-gcc supports -c -o file.o... (cached) yes
  93. checking whether the x86_64-pc-linux-gnu-gcc linker (/usr/x86_64-pc-linux-gnu/bin/ld -m elf_x86_64) supports shared libraries... yes
  94. checking whether -lc should be explicitly linked in... no
  95. checking dynamic linker characteristics... GNU/Linux ld.so
  96. checking how to hardcode library paths into programs... immediate
  97. checking whether stripping libraries is possible... yes
  98. checking if libtool supports shared libraries... yes
  99. checking whether to build shared libraries... yes
  100. checking whether to build static libraries... no
  101. checking for UNIQUE... yes
  102. checking for X... libraries , headers
  103. checking for pkg-config... /usr/bin/pkg-config
  104. checking for gethostbyname... yes
  105. checking for connect... yes
  106. checking for remove... yes
  107. checking for shmat... yes
  108. checking for IceConnectionNumber in -lICE... yes
  109. checking for UNIQUE_X11... yes
  110. checking for GDBUS... yes
  111. checking fcntl.h usability... yes
  112. checking fcntl.h presence... yes
  113. checking for fcntl.h... yes
  114. checking for sys/types.h... (cached) yes
  115. checking sys/socket.h usability... yes
  116. checking sys/socket.h presence... yes
  117. checking for sys/socket.h... yes
  118. checking sys/un.h usability... yes
  119. checking sys/un.h presence... yes
  120. checking for sys/un.h... yes
  121. checking for default IPC mechanism... GDBus
  122. checking for gobject-introspection... yes
  123. checking for gtkdoc-check... /usr/bin/gtkdoc-check
  124. checking for gtkdoc-rebase... /usr/bin/gtkdoc-rebase
  125. checking for gtkdoc-mkpdf... /usr/bin/gtkdoc-mkpdf
  126. checking whether to build gtk-doc documentation... no
  127. configure: creating ./config.status
  128. config.status: creating Makefile
  129. config.status: creating unique.pc
  130. config.status: creating build/Makefile
  131. config.status: creating build/autotools/Makefile
  132. config.status: creating doc/Makefile
  133. config.status: creating doc/reference/Makefile
  134. config.status: creating doc/reference/version.xml
  135. config.status: creating unique/Makefile
  136. config.status: creating unique/uniqueversion.h
  137. config.status: creating unique/bacon/Makefile
  138. config.status: creating unique/dbus/Makefile
  139. config.status: creating unique/gdbus/Makefile
  140. config.status: creating tests/Makefile
  141. config.status: creating config.h
  142. config.status: executing depfiles commands
  143. config.status: executing libtool commands
  144.  
  145. Unique 3.0.2
  146.  
  147. Configuration:
  148.             Maintainer flags: no
  149.                  Debug level: minimum
  150.          Build documentation: no
  151.     Build introspection data: yes
  152.  
  153. Backends:
  154.           Unix Domain Socket: yes
  155.                        D-BUS: no
  156.                        GDBus: yes
  157.  
  158.              Default backend: gdbus
  159.  
  160. >>> Source configured.
  161. >>> Compiling source in /var/tmp/portage/dev-libs/libunique-3.0.2/work/libunique-3.0.2 ...
  162. make -j3
  163. make  all-recursive
  164. make[1]: Entering directory `/var/tmp/portage/dev-libs/libunique-3.0.2/work/libunique-3.0.2'
  165. Making all in build
  166. make[2]: Entering directory `/var/tmp/portage/dev-libs/libunique-3.0.2/work/libunique-3.0.2/build'
  167. Making all in autotools
  168. make[3]: Entering directory `/var/tmp/portage/dev-libs/libunique-3.0.2/work/libunique-3.0.2/build/autotools'
  169. make[3]: Nothing to be done for `all'.
  170. make[3]: Leaving directory `/var/tmp/portage/dev-libs/libunique-3.0.2/work/libunique-3.0.2/build/autotools'
  171. make[3]: Entering directory `/var/tmp/portage/dev-libs/libunique-3.0.2/work/libunique-3.0.2/build'
  172. make[3]: Nothing to be done for `all-am'.
  173. make[3]: Leaving directory `/var/tmp/portage/dev-libs/libunique-3.0.2/work/libunique-3.0.2/build'
  174. make[2]: Leaving directory `/var/tmp/portage/dev-libs/libunique-3.0.2/work/libunique-3.0.2/build'
  175. Making all in unique
  176. make[2]: Entering directory `/var/tmp/portage/dev-libs/libunique-3.0.2/work/libunique-3.0.2/unique'
  177.   GEN    stamp-enum-types
  178.   GEN    stamp-marshal
  179. make  all-recursive
  180. make[3]: Entering directory `/var/tmp/portage/dev-libs/libunique-3.0.2/work/libunique-3.0.2/unique'
  181. Making all in bacon
  182. make[4]: Entering directory `/var/tmp/portage/dev-libs/libunique-3.0.2/work/libunique-3.0.2/unique/bacon'
  183.   CC     libunique_bacon_la-uniquebackend-bacon.lo
  184. /bin/sh ../../libtool --silent --tag=CC   --mode=compile x86_64-pc-linux-gnu-gcc -DHAVE_CONFIG_H -I. -I../.. -I../.. -DG_LOG_DOMAIN=\"Unique-Bacon\" -DG_DISABLE_SINGLE_INCLUDES  -DGSEAL_ENABLE -pthread -I/usr/include/glib-2.0 -I/usr/lib64/glib-2.0/include -I/usr/include/gtk-3.0 -I/usr/include/atk-1.0 -I/usr/include/cairo -I/usr/include/gdk-pixbuf-2.0 -I/usr/include/pango-1.0 -I/usr/include/pixman-1 -I/usr/include/freetype2 -I/usr/include/libpng14 -I/usr/include/libdrm       -march=core2 -O2 -pipe -mtune=generic -c -o libunique_bacon_la-uniquebackend-bacon.lo `test -f 'uniquebackend-bacon.c' || echo './'`uniquebackend-bacon.c
  185.   CC     libunique_bacon_la-uniquefactory-bacon.lo
  186. /bin/sh ../../libtool --silent --tag=CC   --mode=compile x86_64-pc-linux-gnu-gcc -DHAVE_CONFIG_H -I. -I../.. -I../.. -DG_LOG_DOMAIN=\"Unique-Bacon\" -DG_DISABLE_SINGLE_INCLUDES  -DGSEAL_ENABLE -pthread -I/usr/include/glib-2.0 -I/usr/lib64/glib-2.0/include -I/usr/include/gtk-3.0 -I/usr/include/atk-1.0 -I/usr/include/cairo -I/usr/include/gdk-pixbuf-2.0 -I/usr/include/pango-1.0 -I/usr/include/pixman-1 -I/usr/include/freetype2 -I/usr/include/libpng14 -I/usr/include/libdrm       -march=core2 -O2 -pipe -mtune=generic -c -o libunique_bacon_la-uniquefactory-bacon.lo `test -f 'uniquefactory-bacon.c' || echo './'`uniquefactory-bacon.c
  187.   CC     libunique_bacon_la-uniquemessage-bacon.lo
  188. /bin/sh ../../libtool --silent --tag=CC   --mode=compile x86_64-pc-linux-gnu-gcc -DHAVE_CONFIG_H -I. -I../.. -I../.. -DG_LOG_DOMAIN=\"Unique-Bacon\" -DG_DISABLE_SINGLE_INCLUDES  -DGSEAL_ENABLE -pthread -I/usr/include/glib-2.0 -I/usr/lib64/glib-2.0/include -I/usr/include/gtk-3.0 -I/usr/include/atk-1.0 -I/usr/include/cairo -I/usr/include/gdk-pixbuf-2.0 -I/usr/include/pango-1.0 -I/usr/include/pixman-1 -I/usr/include/freetype2 -I/usr/include/libpng14 -I/usr/include/libdrm       -march=core2 -O2 -pipe -mtune=generic -c -o libunique_bacon_la-uniquemessage-bacon.lo `test -f 'uniquemessage-bacon.c' || echo './'`uniquemessage-bacon.c
  189.   CCLD   libunique-bacon.la
  190. make[4]: Leaving directory `/var/tmp/portage/dev-libs/libunique-3.0.2/work/libunique-3.0.2/unique/bacon'
  191. Making all in gdbus
  192. make[4]: Entering directory `/var/tmp/portage/dev-libs/libunique-3.0.2/work/libunique-3.0.2/unique/gdbus'
  193.   CC     libunique_gdbus_la-uniquebackend-gdbus.lo
  194. /bin/sh ../../libtool --silent --tag=CC   --mode=compile x86_64-pc-linux-gnu-gcc -DHAVE_CONFIG_H -I. -I../..  -DG_LOG_DOMAIN=\"Unique-GDBus\" -DG_DISABLE_SINGLE_INCLUDES -I../..   -DGSEAL_ENABLE -pthread -I/usr/include/glib-2.0 -I/usr/lib64/glib-2.0/include -I/usr/include/gtk-3.0 -I/usr/include/atk-1.0 -I/usr/include/cairo -I/usr/include/gdk-pixbuf-2.0 -I/usr/include/pango-1.0 -I/usr/include/pixman-1 -I/usr/include/freetype2 -I/usr/include/libpng14 -I/usr/include/libdrm     -DG_DISABLE_CAST_CHECKS  -pthread -I/usr/include/glib-2.0 -I/usr/lib64/glib-2.0/include    -march=core2 -O2 -pipe -mtune=generic -c -o libunique_gdbus_la-uniquebackend-gdbus.lo `test -f 'uniquebackend-gdbus.c' || echo './'`uniquebackend-gdbus.c
  195.   CCLD   libunique-gdbus.la
  196. make[4]: Leaving directory `/var/tmp/portage/dev-libs/libunique-3.0.2/work/libunique-3.0.2/unique/gdbus'
  197. make[4]: Entering directory `/var/tmp/portage/dev-libs/libunique-3.0.2/work/libunique-3.0.2/unique'
  198.   CC     uniqueapp.lo
  199. /bin/sh ../libtool --silent --tag=CC   --mode=compile x86_64-pc-linux-gnu-gcc -DHAVE_CONFIG_H -I. -I.. -I.. -DG_DISABLE_SINGLE_INCLUDES -DGTK_DISABLE_SINGLE_INCLUDES -DG_DISABLE_DEPRECATED -DGTK_DISABLE_DEPRECATED -DG_LOG_DOMAIN=\"Unique\" -DPREFIX=\""/usr"\"  -DG_DISABLE_CAST_CHECKS     -DGSEAL_ENABLE -pthread -I/usr/include/glib-2.0 -I/usr/lib64/glib-2.0/include -I/usr/include/gtk-3.0 -I/usr/include/atk-1.0 -I/usr/include/cairo -I/usr/include/gdk-pixbuf-2.0 -I/usr/include/pango-1.0 -I/usr/include/pixman-1 -I/usr/include/freetype2 -I/usr/include/libpng14 -I/usr/include/libdrm     -march=core2 -O2 -pipe -mtune=generic -c -o uniqueapp.lo `test -f './uniqueapp.c' || echo './'`./uniqueapp.c
  200.   CC     uniquebackend.lo
  201. /bin/sh ../libtool --silent --tag=CC   --mode=compile x86_64-pc-linux-gnu-gcc -DHAVE_CONFIG_H -I. -I.. -I.. -DG_DISABLE_SINGLE_INCLUDES -DGTK_DISABLE_SINGLE_INCLUDES -DG_DISABLE_DEPRECATED -DGTK_DISABLE_DEPRECATED -DG_LOG_DOMAIN=\"Unique\" -DPREFIX=\""/usr"\"  -DG_DISABLE_CAST_CHECKS     -DGSEAL_ENABLE -pthread -I/usr/include/glib-2.0 -I/usr/lib64/glib-2.0/include -I/usr/include/gtk-3.0 -I/usr/include/atk-1.0 -I/usr/include/cairo -I/usr/include/gdk-pixbuf-2.0 -I/usr/include/pango-1.0 -I/usr/include/pixman-1 -I/usr/include/freetype2 -I/usr/include/libpng14 -I/usr/include/libdrm     -march=core2 -O2 -pipe -mtune=generic -c -o uniquebackend.lo `test -f './uniquebackend.c' || echo './'`./uniquebackend.c
  202.   CC     uniquemessage.lo
  203. /bin/sh ../libtool --silent --tag=CC   --mode=compile x86_64-pc-linux-gnu-gcc -DHAVE_CONFIG_H -I. -I.. -I.. -DG_DISABLE_SINGLE_INCLUDES -DGTK_DISABLE_SINGLE_INCLUDES -DG_DISABLE_DEPRECATED -DGTK_DISABLE_DEPRECATED -DG_LOG_DOMAIN=\"Unique\" -DPREFIX=\""/usr"\"  -DG_DISABLE_CAST_CHECKS     -DGSEAL_ENABLE -pthread -I/usr/include/glib-2.0 -I/usr/lib64/glib-2.0/include -I/usr/include/gtk-3.0 -I/usr/include/atk-1.0 -I/usr/include/cairo -I/usr/include/gdk-pixbuf-2.0 -I/usr/include/pango-1.0 -I/usr/include/pixman-1 -I/usr/include/freetype2 -I/usr/include/libpng14 -I/usr/include/libdrm     -march=core2 -O2 -pipe -mtune=generic -c -o uniquemessage.lo `test -f './uniquemessage.c' || echo './'`./uniquemessage.c
  204. In file included from /usr/include/gtk-3.0/gdk/gdkdnd.h:35,
  205.                  from /usr/include/gtk-3.0/gdk/gdkevents.h:36,
  206.                  from /usr/include/gtk-3.0/gdk/gdkdisplay.h:32,
  207.                  from /usr/include/gtk-3.0/gdk/gdkscreen.h:33,
  208.                  from /usr/include/gtk-3.0/gdk/gdkapplaunchcontext.h:32,
  209.                  from /usr/include/gtk-3.0/gdk/gdk.h:33,
  210.                  from ./uniquemessage.h:26,
  211.                  from ./uniquemessage.c:29:
  212. /usr/include/gtk-3.0/gdk/gdkdevice.h:159: error: expected '=', ',', ';', 'asm' or '__attribute__' before 'gchar'
  213. In file included from /usr/include/gtk-3.0/gdk/gdkscreen.h:33,
  214.                  from /usr/include/gtk-3.0/gdk/gdkapplaunchcontext.h:32,
  215.                  from /usr/include/gtk-3.0/gdk/gdk.h:33,
  216.                  from ./uniquemessage.h:26,
  217.                  from ./uniquemessage.c:29:
  218. /usr/include/gtk-3.0/gdk/gdkdisplay.h:47: error: expected '=', ',', ';', 'asm' or '__attribute__' before 'gchar'
  219. In file included from /usr/include/gtk-3.0/gdk/gdk.h:46,
  220.                  from ./uniquemessage.h:26,
  221.                  from ./uniquemessage.c:29:
  222. /usr/include/gtk-3.0/gdk/gdkmain.h:53: error: expected '=', ',', ';', 'asm' or '__attribute__' before 'gchar'
  223. /usr/include/gtk-3.0/gdk/gdkmain.h:67: error: expected '=', ',', ';', 'asm' or '__attribute__' before 'gchar'
  224. In file included from /usr/include/gtk-3.0/gtk/gtkstyle.h:37,
  225.                  from /usr/include/gtk-3.0/gtk/gtkwidget.h:37,
  226.                  from /usr/include/gtk-3.0/gtk/gtkaction.h:38,
  227.                  from /usr/include/gtk-3.0/gtk/gtkactiongroup.h:38,
  228.                  from /usr/include/gtk-3.0/gtk/gtkapplication.h:29,
  229.                  from /usr/include/gtk-3.0/gtk/gtkwindow.h:35,
  230.                  from /usr/include/gtk-3.0/gtk/gtkdialog.h:35,
  231.                  from /usr/include/gtk-3.0/gtk/gtkaboutdialog.h:32,
  232.                  from /usr/include/gtk-3.0/gtk/gtk.h:33,
  233.                  from ./uniqueapp.h:27,
  234.                  from ./uniqueinternals.h:6,
  235.                  from ./uniquemessage.c:30:
  236. /usr/include/gtk-3.0/gtk/gtkwidgetpath.h:55: error: expected '=', ',', ';', 'asm' or '__attribute__' before 'gchar'
  237. In file included from /usr/include/gtk-3.0/gtk/gtkstyleprovider.h:29,
  238.                  from /usr/include/gtk-3.0/gtk/gtkstylecontext.h:28,
  239.                  from /usr/include/gtk-3.0/gtk/gtkwidget.h:40,
  240.                  from /usr/include/gtk-3.0/gtk/gtkaction.h:38,
  241.                  from /usr/include/gtk-3.0/gtk/gtkactiongroup.h:38,
  242.                  from /usr/include/gtk-3.0/gtk/gtkapplication.h:29,
  243.                  from /usr/include/gtk-3.0/gtk/gtkwindow.h:35,
  244.                  from /usr/include/gtk-3.0/gtk/gtkdialog.h:35,
  245.                  from /usr/include/gtk-3.0/gtk/gtkaboutdialog.h:32,
  246.                  from /usr/include/gtk-3.0/gtk/gtk.h:33,
  247.                  from ./uniqueapp.h:27,
  248.                  from ./uniqueinternals.h:6,
  249.                  from ./uniquemessage.c:30:
  250. /usr/include/gtk-3.0/gtk/gtkiconfactory.h:112: error: expected '=', ',', ';', 'asm' or '__attribute__' before 'gchar'
  251. /usr/include/gtk-3.0/gtk/gtkiconfactory.h:156: error: expected '=', ',', ';', 'asm' or '__attribute__' before 'gchar'
  252. /usr/include/gtk-3.0/gtk/gtkiconfactory.h:157: error: expected '=', ',', ';', 'asm' or '__attribute__' before 'gchar'
  253. In file included from /usr/include/gtk-3.0/gtk/gtkwidget.h:40,
  254.                  from /usr/include/gtk-3.0/gtk/gtkaction.h:38,
  255.                  from /usr/include/gtk-3.0/gtk/gtkactiongroup.h:38,
  256.                  from /usr/include/gtk-3.0/gtk/gtkapplication.h:29,
  257.                  from /usr/include/gtk-3.0/gtk/gtkwindow.h:35,
  258.                  from /usr/include/gtk-3.0/gtk/gtkdialog.h:35,
  259.                  from /usr/include/gtk-3.0/gtk/gtkaboutdialog.h:32,
  260.                  from /usr/include/gtk-3.0/gtk/gtk.h:33,
  261.                  from ./uniqueapp.h:27,
  262.                  from ./uniqueinternals.h:6,
  263.                  from ./uniquemessage.c:30:
  264. /usr/include/gtk-3.0/gtk/gtkstylecontext.h:559: error: expected '=', ',', ';', 'asm' or '__attribute__' before 'GtkWidgetPath'
  265. In file included from /usr/include/gtk-3.0/gdk/gdkdnd.h:35,
  266.                  from /usr/include/gtk-3.0/gdk/gdkevents.h:36,
  267.                  from /usr/include/gtk-3.0/gdk/gdkdisplay.h:32,
  268.                  from /usr/include/gtk-3.0/gdk/gdkscreen.h:33,
  269.                  from /usr/include/gtk-3.0/gdk/gdkapplaunchcontext.h:32,
  270.                  from /usr/include/gtk-3.0/gdk/gdk.h:33,
  271.                  from ./uniqueapp.c:60:
  272. /usr/include/gtk-3.0/gdk/gdkdevice.h:159: error: expected '=', ',', ';', 'asm' or '__attribute__' before 'gchar'
  273. In file included from /usr/include/gtk-3.0/gdk/gdkscreen.h:33,
  274.                  from /usr/include/gtk-3.0/gdk/gdkapplaunchcontext.h:32,
  275.                  from /usr/include/gtk-3.0/gdk/gdk.h:33,
  276.                  from ./uniqueapp.c:60:
  277. /usr/include/gtk-3.0/gdk/gdkdisplay.h:47: error: expected '=', ',', ';', 'asm' or '__attribute__' before 'gchar'
  278. In file included from /usr/include/gtk-3.0/gdk/gdk.h:46,
  279.                  from ./uniqueapp.c:60:
  280. /usr/include/gtk-3.0/gdk/gdkmain.h:53: error: expected '=', ',', ';', 'asm' or '__attribute__' before 'gchar'
  281. /usr/include/gtk-3.0/gdk/gdkmain.h:67: error: expected '=', ',', ';', 'asm' or '__attribute__' before 'gchar'
  282. In file included from /usr/include/gtk-3.0/gtk/gtkaction.h:38,
  283.                  from /usr/include/gtk-3.0/gtk/gtkactiongroup.h:38,
  284.                  from /usr/include/gtk-3.0/gtk/gtkapplication.h:29,
  285.                  from /usr/include/gtk-3.0/gtk/gtkwindow.h:35,
  286.                  from /usr/include/gtk-3.0/gtk/gtkdialog.h:35,
  287.                  from /usr/include/gtk-3.0/gtk/gtkaboutdialog.h:32,
  288.                  from /usr/include/gtk-3.0/gtk/gtk.h:33,
  289.                  from ./uniqueapp.h:27,
  290.                  from ./uniqueinternals.h:6,
  291.                  from ./uniquemessage.c:30:
  292. /usr/include/gtk-3.0/gtk/gtkwidget.h:580: error: expected '=', ',', ';', 'asm' or '__attribute__' before 'gchar'
  293. In file included from /usr/include/gtk-3.0/gtk/gtkactiongroup.h:38,
  294.                  from /usr/include/gtk-3.0/gtk/gtkapplication.h:29,
  295.                  from /usr/include/gtk-3.0/gtk/gtkwindow.h:35,
  296.                  from /usr/include/gtk-3.0/gtk/gtkdialog.h:35,
  297.                  from /usr/include/gtk-3.0/gtk/gtkaboutdialog.h:32,
  298.                  from /usr/include/gtk-3.0/gtk/gtk.h:33,
  299.                  from ./uniqueapp.h:27,
  300.                  from ./uniqueinternals.h:6,
  301.                  from ./uniquemessage.c:30:
  302. /usr/include/gtk-3.0/gtk/gtkaction.h:93: error: expected '=', ',', ';', 'asm' or '__attribute__' before 'gchar'
  303. /usr/include/gtk-3.0/gtk/gtkaction.h:111: error: expected '=', ',', ';', 'asm' or '__attribute__' before 'gchar'
  304. /usr/include/gtk-3.0/gtk/gtkaction.h:136: error: expected '=', ',', ';', 'asm' or '__attribute__' before 'gchar'
  305. /usr/include/gtk-3.0/gtk/gtkaction.h:139: error: expected '=', ',', ';', 'asm' or '__attribute__' before 'gchar'
  306. /usr/include/gtk-3.0/gtk/gtkaction.h:142: error: expected '=', ',', ';', 'asm' or '__attribute__' before 'gchar'
  307. /usr/include/gtk-3.0/gtk/gtkaction.h:145: error: expected '=', ',', ';', 'asm' or '__attribute__' before 'gchar'
  308. /usr/include/gtk-3.0/gtk/gtkaction.h:151: error: expected '=', ',', ';', 'asm' or '__attribute__' before 'gchar'
  309. In file included from /usr/include/gtk-3.0/gtk/gtkapplication.h:29,
  310.                  from /usr/include/gtk-3.0/gtk/gtkwindow.h:35,
  311.                  from /usr/include/gtk-3.0/gtk/gtkdialog.h:35,
  312.                  from /usr/include/gtk-3.0/gtk/gtkaboutdialog.h:32,
  313.                  from /usr/include/gtk-3.0/gtk/gtk.h:33,
  314.                  from ./uniqueapp.h:27,
  315.                  from ./uniqueinternals.h:6,
  316.                  from ./uniquemessage.c:30:
  317. /usr/include/gtk-3.0/gtk/gtkactiongroup.h:163: error: expected '=', ',', ';', 'asm' or '__attribute__' before 'gchar'
  318. /usr/include/gtk-3.0/gtk/gtkactiongroup.h:217: error: expected '=', ',', ';', 'asm' or '__attribute__' before 'gchar'
  319. In file included from /usr/include/gtk-3.0/gdk/gdkdnd.h:35,
  320.                  from /usr/include/gtk-3.0/gdk/gdkevents.h:36,
  321.                  from /usr/include/gtk-3.0/gdk/gdkdisplay.h:32,
  322.                  from /usr/include/gtk-3.0/gdk/gdkscreen.h:33,
  323.                  from /usr/include/gtk-3.0/gdk/gdkapplaunchcontext.h:32,
  324.                  from /usr/include/gtk-3.0/gdk/gdk.h:33,
  325.                  from ./uniquebackend.c:38:
  326. /usr/include/gtk-3.0/gdk/gdkdevice.h:159: error: expected '=', ',', ';', 'asm' or '__attribute__' before 'gchar'
  327. In file included from /usr/include/gtk-3.0/gtk/gtkdialog.h:35,
  328.                  from /usr/include/gtk-3.0/gtk/gtkaboutdialog.h:32,
  329.                  from /usr/include/gtk-3.0/gtk/gtk.h:33,
  330.                  from ./uniqueapp.h:27,
  331.                  from ./uniqueinternals.h:6,
  332.                  from ./uniquemessage.c:30:
  333. /usr/include/gtk-3.0/gtk/gtkwindow.h:111: error: expected '=', ',', ';', 'asm' or '__attribute__' before 'gchar'
  334. /usr/include/gtk-3.0/gtk/gtkwindow.h:119: error: expected '=', ',', ';', 'asm' or '__attribute__' before 'gchar'
  335. /usr/include/gtk-3.0/gtk/gtkwindow.h:206: error: expected '=', ',', ';', 'asm' or '__attribute__' before 'gchar'
  336. /usr/include/gtk-3.0/gtk/gtkwindow.h:212: error: expected '=', ',', ';', 'asm' or '__attribute__' before 'gchar'
  337. In file included from /usr/include/gtk-3.0/gtk/gtk.h:33,
  338.                  from ./uniqueapp.h:27,
  339.                  from ./uniqueinternals.h:6,
  340.                  from ./uniquemessage.c:30:
  341. /usr/include/gtk-3.0/gtk/gtkaboutdialog.h:115: error: expected '=', ',', ';', 'asm' or '__attribute__' before 'gchar'
  342. /usr/include/gtk-3.0/gtk/gtkaboutdialog.h:118: error: expected '=', ',', ';', 'asm' or '__attribute__' before 'gchar'
  343. /usr/include/gtk-3.0/gtk/gtkaboutdialog.h:121: error: expected '=', ',', ';', 'asm' or '__attribute__' before 'gchar'
  344. /usr/include/gtk-3.0/gtk/gtkaboutdialog.h:124: error: expected '=', ',', ';', 'asm' or '__attribute__' before 'gchar'
  345. /usr/include/gtk-3.0/gtk/gtkaboutdialog.h:127: error: expected '=', ',', ';', 'asm' or '__attribute__' before 'gchar'
  346. /usr/include/gtk-3.0/gtk/gtkaboutdialog.h:138: error: expected '=', ',', ';', 'asm' or '__attribute__' before 'gchar'
  347. /usr/include/gtk-3.0/gtk/gtkaboutdialog.h:141: error: expected '=', ',', ';', 'asm' or '__attribute__' before 'gchar'
  348. /usr/include/gtk-3.0/gtk/gtkaboutdialog.h:144: error: expected '=', ',', ';', 'asm' or '__attribute__' before 'gchar'
  349. /usr/include/gtk-3.0/gtk/gtkaboutdialog.h:147: error: expected '=', ',', ';', 'asm' or '__attribute__' before 'gchar'
  350. /usr/include/gtk-3.0/gtk/gtkaboutdialog.h:150: error: expected '=', ',', ';', 'asm' or '__attribute__' before 'gchar'
  351. /usr/include/gtk-3.0/gtk/gtkaboutdialog.h:153: error: expected '=', ',', ';', 'asm' or '__attribute__' before 'gchar'
  352. /usr/include/gtk-3.0/gtk/gtkaboutdialog.h:159: error: expected '=', ',', ';', 'asm' or '__attribute__' before 'gchar'
  353. In file included from /usr/include/gtk-3.0/gdk/gdkscreen.h:33,
  354.                  from /usr/include/gtk-3.0/gdk/gdkapplaunchcontext.h:32,
  355.                  from /usr/include/gtk-3.0/gdk/gdk.h:33,
  356.                  from ./uniquebackend.c:38:
  357. /usr/include/gtk-3.0/gdk/gdkdisplay.h:47: error: expected '=', ',', ';', 'asm' or '__attribute__' before 'gchar'
  358. In file included from /usr/include/gtk-3.0/gtk/gtklabel.h:36,
  359.                  from /usr/include/gtk-3.0/gtk/gtkaccellabel.h:38,
  360.                  from /usr/include/gtk-3.0/gtk/gtk.h:35,
  361.                  from ./uniqueapp.h:27,
  362.                  from ./uniqueinternals.h:6,
  363.                  from ./uniquemessage.c:30:
  364. /usr/include/gtk-3.0/gtk/gtkmenu.h:187: error: expected '=', ',', ';', 'asm' or '__attribute__' before 'gchar'
  365. In file included from /usr/include/gtk-3.0/gtk/gtkaccellabel.h:38,
  366.                  from /usr/include/gtk-3.0/gtk/gtk.h:35,
  367.                  from ./uniqueapp.h:27,
  368.                  from ./uniqueinternals.h:6,
  369.                  from ./uniquemessage.c:30:
  370. /usr/include/gtk-3.0/gtk/gtklabel.h:96: error: expected '=', ',', ';', 'asm' or '__attribute__' before 'gchar'
  371. /usr/include/gtk-3.0/gtk/gtklabel.h:102: error: expected '=', ',', ';', 'asm' or '__attribute__' before 'gchar'
  372. /usr/include/gtk-3.0/gtk/gtklabel.h:162: error: expected '=', ',', ';', 'asm' or '__attribute__' before 'gchar'
  373. In file included from /usr/include/gtk-3.0/gdk/gdkx.h:45,
  374.                  from ./uniqueapp.c:63:
  375. /usr/include/gtk-3.0/gdk/x11/gdkx11display.h:63: error: expected '=', ',', ';', 'asm' or '__attribute__' before 'gchar'
  376. In file included from /usr/include/gtk-3.0/gdk/gdkx.h:49,
  377.                  from ./uniqueapp.c:63:
  378. /usr/include/gtk-3.0/gdk/x11/gdkx11property.h:48: error: expected '=', ',', ';', 'asm' or '__attribute__' before 'gchar'
  379. /usr/include/gtk-3.0/gdk/x11/gdkx11property.h:54: error: expected '=', ',', ';', 'asm' or '__attribute__' before 'gchar'
  380. In file included from /usr/include/gtk-3.0/gdk/gdk.h:46,
  381.                  from ./uniquebackend.c:38:
  382. /usr/include/gtk-3.0/gdk/gdkmain.h:53: error: expected '=', ',', ';', 'asm' or '__attribute__' before 'gchar'
  383. /usr/include/gtk-3.0/gdk/gdkmain.h:67: error: expected '=', ',', ';', 'asm' or '__attribute__' before 'gchar'
  384. In file included from /usr/include/gtk-3.0/gtk/gtkstyle.h:37,
  385.                  from /usr/include/gtk-3.0/gtk/gtkwidget.h:37,
  386.                  from /usr/include/gtk-3.0/gtk/gtkaction.h:38,
  387.                  from /usr/include/gtk-3.0/gtk/gtkactiongroup.h:38,
  388.                  from /usr/include/gtk-3.0/gtk/gtkapplication.h:29,
  389.                  from /usr/include/gtk-3.0/gtk/gtkwindow.h:35,
  390.                  from /usr/include/gtk-3.0/gtk/gtkdialog.h:35,
  391.                  from /usr/include/gtk-3.0/gtk/gtkaboutdialog.h:32,
  392.                  from /usr/include/gtk-3.0/gtk/gtk.h:33,
  393.                  from ./uniqueapp.h:27,
  394.                  from ./uniqueapp.c:66:
  395. /usr/include/gtk-3.0/gtk/gtkwidgetpath.h:55: error: expected '=', ',', ';', 'asm' or '__attribute__' before 'gchar'
  396. In file included from /usr/include/gtk-3.0/gtk/gtktreeviewcolumn.h:30,
  397.                  from /usr/include/gtk-3.0/gtk/gtktreeview.h:29,
  398.                  from /usr/include/gtk-3.0/gtk/gtkcombobox.h:29,
  399.                  from /usr/include/gtk-3.0/gtk/gtkappchooserbutton.h:31,
  400.                  from /usr/include/gtk-3.0/gtk/gtk.h:46,
  401.                  from ./uniqueapp.h:27,
  402.                  from ./uniqueinternals.h:6,
  403.                  from ./uniquemessage.c:30:
  404. /usr/include/gtk-3.0/gtk/gtkcellarea.h:356: error: expected '=', ',', ';', 'asm' or '__attribute__' before 'gchar'
  405. /usr/include/gtk-3.0/gtk/gtkcellarea.h:435: error: expected '=', ',', ';', 'asm' or '__attribute__' before 'GList'
  406. In file included from /usr/include/gtk-3.0/gtk/gtktreeview.h:29,
  407.                  from /usr/include/gtk-3.0/gtk/gtkcombobox.h:29,
  408.                  from /usr/include/gtk-3.0/gtk/gtkappchooserbutton.h:31,
  409.                  from /usr/include/gtk-3.0/gtk/gtk.h:46,
  410.                  from ./uniqueapp.h:27,
  411.                  from ./uniqueinternals.h:6,
  412.                  from ./uniquemessage.c:30:
  413. /usr/include/gtk-3.0/gtk/gtktreeviewcolumn.h:163: error: expected '=', ',', ';', 'asm' or '__attribute__' before 'gchar'
  414. In file included from /usr/include/gtk-3.0/gtk/gtkstyleprovider.h:29,
  415.                  from /usr/include/gtk-3.0/gtk/gtkstylecontext.h:28,
  416.                  from /usr/include/gtk-3.0/gtk/gtkwidget.h:40,
  417.                  from /usr/include/gtk-3.0/gtk/gtkaction.h:38,
  418.                  from /usr/include/gtk-3.0/gtk/gtkactiongroup.h:38,
  419.                  from /usr/include/gtk-3.0/gtk/gtkapplication.h:29,
  420.                  from /usr/include/gtk-3.0/gtk/gtkwindow.h:35,
  421.                  from /usr/include/gtk-3.0/gtk/gtkdialog.h:35,
  422.                  from /usr/include/gtk-3.0/gtk/gtkaboutdialog.h:32,
  423.                  from /usr/include/gtk-3.0/gtk/gtk.h:33,
  424.                  from ./uniqueapp.h:27,
  425.                  from ./uniqueapp.c:66:
  426. /usr/include/gtk-3.0/gtk/gtkiconfactory.h:112: error: expected '=', ',', ';', 'asm' or '__attribute__' before 'gchar'
  427. /usr/include/gtk-3.0/gtk/gtkiconfactory.h:156: error: expected '=', ',', ';', 'asm' or '__attribute__' before 'gchar'
  428. /usr/include/gtk-3.0/gtk/gtkiconfactory.h:157: error: expected '=', ',', ';', 'asm' or '__attribute__' before 'gchar'
  429. In file included from /usr/include/gtk-3.0/gtk/gtkwidget.h:40,
  430.                  from /usr/include/gtk-3.0/gtk/gtkaction.h:38,
  431.                  from /usr/include/gtk-3.0/gtk/gtkactiongroup.h:38,
  432.                  from /usr/include/gtk-3.0/gtk/gtkapplication.h:29,
  433.                  from /usr/include/gtk-3.0/gtk/gtkwindow.h:35,
  434.                  from /usr/include/gtk-3.0/gtk/gtkdialog.h:35,
  435.                  from /usr/include/gtk-3.0/gtk/gtkaboutdialog.h:32,
  436.                  from /usr/include/gtk-3.0/gtk/gtk.h:33,
  437.                  from ./uniqueapp.h:27,
  438.                  from ./uniqueapp.c:66:
  439. /usr/include/gtk-3.0/gtk/gtkstylecontext.h:559: error: expected '=', ',', ';', 'asm' or '__attribute__' before 'GtkWidgetPath'
  440. In file included from /usr/include/gtk-3.0/gtk/gtkentry.h:42,
  441.                  from /usr/include/gtk-3.0/gtk/gtktreeview.h:31,
  442.                  from /usr/include/gtk-3.0/gtk/gtkcombobox.h:29,
  443.                  from /usr/include/gtk-3.0/gtk/gtkappchooserbutton.h:31,
  444.                  from /usr/include/gtk-3.0/gtk/gtk.h:46,
  445.                  from ./uniqueapp.h:27,
  446.                  from ./uniqueinternals.h:6,
  447.                  from ./uniquemessage.c:30:
  448. /usr/include/gtk-3.0/gtk/gtkentrybuffer.h:104: error: expected '=', ',', ';', 'asm' or '__attribute__' before 'gchar'
  449. In file included from /usr/include/gtk-3.0/gtk/gtkentry.h:44,
  450.                  from /usr/include/gtk-3.0/gtk/gtktreeview.h:31,
  451.                  from /usr/include/gtk-3.0/gtk/gtkcombobox.h:29,
  452.                  from /usr/include/gtk-3.0/gtk/gtkappchooserbutton.h:31,
  453.                  from /usr/include/gtk-3.0/gtk/gtk.h:46,
  454.                  from ./uniqueapp.h:27,
  455.                  from ./uniqueinternals.h:6,
  456.                  from ./uniquemessage.c:30:
  457. /usr/include/gtk-3.0/gtk/gtkimage.h:158: error: expected declaration specifiers or '...' before 'G_CONST_RETURN'
  458. In file included from /usr/include/gtk-3.0/gtk/gtktreeview.h:31,
  459.                  from /usr/include/gtk-3.0/gtk/gtkcombobox.h:29,
  460.                  from /usr/include/gtk-3.0/gtk/gtkappchooserbutton.h:31,
  461.                  from /usr/include/gtk-3.0/gtk/gtk.h:46,
  462.                  from ./uniqueapp.h:27,
  463.                  from ./uniqueinternals.h:6,
  464.                  from ./uniquemessage.c:30:
  465. /usr/include/gtk-3.0/gtk/gtkentry.h:154: error: expected '=', ',', ';', 'asm' or '__attribute__' before 'GtkBorder'
  466. /usr/include/gtk-3.0/gtk/gtkentry.h:179: error: expected '=', ',', ';', 'asm' or '__attribute__' before 'gchar'
  467. In file included from /usr/include/gtk-3.0/gtk/gtkappchooserbutton.h:31,
  468.                  from /usr/include/gtk-3.0/gtk/gtk.h:46,
  469.                  from ./uniqueapp.h:27,
  470.                  from ./uniqueinternals.h:6,
  471.                  from ./uniquemessage.c:30:
  472. /usr/include/gtk-3.0/gtk/gtkcombobox.h:91: error: expected '=', ',', ';', 'asm' or '__attribute__' before 'gchar'
  473. In file included from /usr/include/gtk-3.0/gtk/gtkaspectframe.h:35,
  474.                  from /usr/include/gtk-3.0/gtk/gtk.h:49,
  475.                  from ./uniqueapp.h:27,
  476.                  from ./uniqueinternals.h:6,
  477.                  from ./uniquemessage.c:30:
  478. /usr/include/gtk-3.0/gtk/gtkframe.h:79: error: expected '=', ',', ';', 'asm' or '__attribute__' before 'gchar'
  479. In file included from /usr/include/gtk-3.0/gtk/gtk.h:50,
  480.                  from ./uniqueapp.h:27,
  481.                  from ./uniqueinternals.h:6,
  482.                  from ./uniquemessage.c:30:
  483. /usr/include/gtk-3.0/gtk/gtkassistant.h:154: error: expected '=', ',', ';', 'asm' or '__attribute__' before 'gchar'
  484. In file included from /usr/include/gtk-3.0/gdk/gdkx.h:45,
  485.                  from ./uniquebackend.c:40:
  486. /usr/include/gtk-3.0/gdk/x11/gdkx11display.h:63: error: expected '=', ',', ';', 'asm' or '__attribute__' before 'gchar'
  487. In file included from /usr/include/gtk-3.0/gtk/gtk.h:58,
  488.                  from ./uniqueapp.h:27,
  489.                  from ./uniqueinternals.h:6,
  490.                  from ./uniquemessage.c:30:
  491. /usr/include/gtk-3.0/gtk/gtkbutton.h:99: error: expected '=', ',', ';', 'asm' or '__attribute__' before 'gchar'
  492. In file included from /usr/include/gtk-3.0/gdk/gdkx.h:49,
  493.                  from ./uniquebackend.c:40:
  494. /usr/include/gtk-3.0/gdk/x11/gdkx11property.h:48: error: expected '=', ',', ';', 'asm' or '__attribute__' before 'gchar'
  495. /usr/include/gtk-3.0/gdk/x11/gdkx11property.h:54: error: expected '=', ',', ';', 'asm' or '__attribute__' before 'gchar'
  496. In file included from /usr/include/gtk-3.0/gtk/gtkaction.h:38,
  497.                  from /usr/include/gtk-3.0/gtk/gtkactiongroup.h:38,
  498.                  from /usr/include/gtk-3.0/gtk/gtkapplication.h:29,
  499.                  from /usr/include/gtk-3.0/gtk/gtkwindow.h:35,
  500.                  from /usr/include/gtk-3.0/gtk/gtkdialog.h:35,
  501.                  from /usr/include/gtk-3.0/gtk/gtkaboutdialog.h:32,
  502.                  from /usr/include/gtk-3.0/gtk/gtk.h:33,
  503.                  from ./uniqueapp.h:27,
  504.                  from ./uniqueapp.c:66:
  505. /usr/include/gtk-3.0/gtk/gtkwidget.h:580: error: expected '=', ',', ';', 'asm' or '__attribute__' before 'gchar'
  506. In file included from /usr/include/gtk-3.0/gtk/gtkactiongroup.h:38,
  507.                  from /usr/include/gtk-3.0/gtk/gtkapplication.h:29,
  508.                  from /usr/include/gtk-3.0/gtk/gtkwindow.h:35,
  509.                  from /usr/include/gtk-3.0/gtk/gtkdialog.h:35,
  510.                  from /usr/include/gtk-3.0/gtk/gtkaboutdialog.h:32,
  511.                  from /usr/include/gtk-3.0/gtk/gtk.h:33,
  512.                  from ./uniqueapp.h:27,
  513.                  from ./uniqueapp.c:66:
  514. /usr/include/gtk-3.0/gtk/gtkaction.h:93: error: expected '=', ',', ';', 'asm' or '__attribute__' before 'gchar'
  515. /usr/include/gtk-3.0/gtk/gtkaction.h:111: error: expected '=', ',', ';', 'asm' or '__attribute__' before 'gchar'
  516. /usr/include/gtk-3.0/gtk/gtkaction.h:136: error: expected '=', ',', ';', 'asm' or '__attribute__' before 'gchar'
  517. /usr/include/gtk-3.0/gtk/gtkaction.h:139: error: expected '=', ',', ';', 'asm' or '__attribute__' before 'gchar'
  518. /usr/include/gtk-3.0/gtk/gtkaction.h:142: error: expected '=', ',', ';', 'asm' or '__attribute__' before 'gchar'
  519. /usr/include/gtk-3.0/gtk/gtkaction.h:145: error: expected '=', ',', ';', 'asm' or '__attribute__' before 'gchar'
  520. /usr/include/gtk-3.0/gtk/gtkaction.h:151: error: expected '=', ',', ';', 'asm' or '__attribute__' before 'gchar'
  521. In file included from /usr/include/gtk-3.0/gtk/gtkapplication.h:29,
  522.                  from /usr/include/gtk-3.0/gtk/gtkwindow.h:35,
  523.                  from /usr/include/gtk-3.0/gtk/gtkdialog.h:35,
  524.                  from /usr/include/gtk-3.0/gtk/gtkaboutdialog.h:32,
  525.                  from /usr/include/gtk-3.0/gtk/gtk.h:33,
  526.                  from ./uniqueapp.h:27,
  527.                  from ./uniqueapp.c:66:
  528. /usr/include/gtk-3.0/gtk/gtkactiongroup.h:163: error: expected '=', ',', ';', 'asm' or '__attribute__' before 'gchar'
  529. /usr/include/gtk-3.0/gtk/gtkactiongroup.h:217: error: expected '=', ',', ';', 'asm' or '__attribute__' before 'gchar'
  530. In file included from /usr/include/gtk-3.0/gtk/gtkstyle.h:37,
  531.                  from /usr/include/gtk-3.0/gtk/gtkwidget.h:37,
  532.                  from /usr/include/gtk-3.0/gtk/gtkaction.h:38,
  533.                  from /usr/include/gtk-3.0/gtk/gtkactiongroup.h:38,
  534.                  from /usr/include/gtk-3.0/gtk/gtkapplication.h:29,
  535.                  from /usr/include/gtk-3.0/gtk/gtkwindow.h:35,
  536.                  from /usr/include/gtk-3.0/gtk/gtkdialog.h:35,
  537.                  from /usr/include/gtk-3.0/gtk/gtkaboutdialog.h:32,
  538.                  from /usr/include/gtk-3.0/gtk/gtk.h:33,
  539.                  from ../unique/uniqueapp.h:27,
  540.                  from ./uniquebackend.h:27,
  541.                  from ./uniquebackend.c:44:
  542. /usr/include/gtk-3.0/gtk/gtkwidgetpath.h:55: error: expected '=', ',', ';', 'asm' or '__attribute__' before 'gchar'
  543. In file included from /usr/include/gtk-3.0/gtk/gtkdialog.h:35,
  544.                  from /usr/include/gtk-3.0/gtk/gtkaboutdialog.h:32,
  545.                  from /usr/include/gtk-3.0/gtk/gtk.h:33,
  546.                  from ./uniqueapp.h:27,
  547.                  from ./uniqueapp.c:66:
  548. /usr/include/gtk-3.0/gtk/gtkwindow.h:111: error: expected '=', ',', ';', 'asm' or '__attribute__' before 'gchar'
  549. /usr/include/gtk-3.0/gtk/gtkwindow.h:119: error: expected '=', ',', ';', 'asm' or '__attribute__' before 'gchar'
  550. /usr/include/gtk-3.0/gtk/gtkwindow.h:206: error: expected '=', ',', ';', 'asm' or '__attribute__' before 'gchar'
  551. /usr/include/gtk-3.0/gtk/gtkwindow.h:212: error: expected '=', ',', ';', 'asm' or '__attribute__' before 'gchar'
  552. In file included from /usr/include/gtk-3.0/gtk/gtk.h:33,
  553.                  from ./uniqueapp.h:27,
  554.                  from ./uniqueapp.c:66:
  555. /usr/include/gtk-3.0/gtk/gtkaboutdialog.h:115: error: expected '=', ',', ';', 'asm' or '__attribute__' before 'gchar'
  556. /usr/include/gtk-3.0/gtk/gtkaboutdialog.h:118: error: expected '=', ',', ';', 'asm' or '__attribute__' before 'gchar'
  557. /usr/include/gtk-3.0/gtk/gtkaboutdialog.h:121: error: expected '=', ',', ';', 'asm' or '__attribute__' before 'gchar'
  558. /usr/include/gtk-3.0/gtk/gtkaboutdialog.h:124: error: expected '=', ',', ';', 'asm' or '__attribute__' before 'gchar'
  559. /usr/include/gtk-3.0/gtk/gtkaboutdialog.h:127: error: expected '=', ',', ';', 'asm' or '__attribute__' before 'gchar'
  560. /usr/include/gtk-3.0/gtk/gtkaboutdialog.h:138: error: expected '=', ',', ';', 'asm' or '__attribute__' before 'gchar'
  561. /usr/include/gtk-3.0/gtk/gtkaboutdialog.h:141: error: expected '=', ',', ';', 'asm' or '__attribute__' before 'gchar'
  562. /usr/include/gtk-3.0/gtk/gtkaboutdialog.h:144: error: expected '=', ',', ';', 'asm' or '__attribute__' before 'gchar'
  563. /usr/include/gtk-3.0/gtk/gtkaboutdialog.h:147: error: expected '=', ',', ';', 'asm' or '__attribute__' before 'gchar'
  564. /usr/include/gtk-3.0/gtk/gtkaboutdialog.h:150: error: expected '=', ',', ';', 'asm' or '__attribute__' before 'gchar'
  565. /usr/include/gtk-3.0/gtk/gtkaboutdialog.h:153: error: expected '=', ',', ';', 'asm' or '__attribute__' before 'gchar'
  566. /usr/include/gtk-3.0/gtk/gtkaboutdialog.h:159: error: expected '=', ',', ';', 'asm' or '__attribute__' before 'gchar'
  567. In file included from /usr/include/gtk-3.0/gtk/gtkstyleprovider.h:29,
  568.                  from /usr/include/gtk-3.0/gtk/gtkstylecontext.h:28,
  569.                  from /usr/include/gtk-3.0/gtk/gtkwidget.h:40,
  570.                  from /usr/include/gtk-3.0/gtk/gtkaction.h:38,
  571.                  from /usr/include/gtk-3.0/gtk/gtkactiongroup.h:38,
  572.                  from /usr/include/gtk-3.0/gtk/gtkapplication.h:29,
  573.                  from /usr/include/gtk-3.0/gtk/gtkwindow.h:35,
  574.                  from /usr/include/gtk-3.0/gtk/gtkdialog.h:35,
  575.                  from /usr/include/gtk-3.0/gtk/gtkaboutdialog.h:32,
  576.                  from /usr/include/gtk-3.0/gtk/gtk.h:33,
  577.                  from ../unique/uniqueapp.h:27,
  578.                  from ./uniquebackend.h:27,
  579.                  from ./uniquebackend.c:44:
  580. /usr/include/gtk-3.0/gtk/gtkiconfactory.h:112: error: expected '=', ',', ';', 'asm' or '__attribute__' before 'gchar'
  581. /usr/include/gtk-3.0/gtk/gtkiconfactory.h:156: error: expected '=', ',', ';', 'asm' or '__attribute__' before 'gchar'
  582. /usr/include/gtk-3.0/gtk/gtkiconfactory.h:157: error: expected '=', ',', ';', 'asm' or '__attribute__' before 'gchar'
  583. In file included from /usr/include/gtk-3.0/gtk/gtkwidget.h:40,
  584.                  from /usr/include/gtk-3.0/gtk/gtkaction.h:38,
  585.                  from /usr/include/gtk-3.0/gtk/gtkactiongroup.h:38,
  586.                  from /usr/include/gtk-3.0/gtk/gtkapplication.h:29,
  587.                  from /usr/include/gtk-3.0/gtk/gtkwindow.h:35,
  588.                  from /usr/include/gtk-3.0/gtk/gtkdialog.h:35,
  589.                  from /usr/include/gtk-3.0/gtk/gtkaboutdialog.h:32,
  590.                  from /usr/include/gtk-3.0/gtk/gtk.h:33,
  591.                  from ../unique/uniqueapp.h:27,
  592.                  from ./uniquebackend.h:27,
  593.                  from ./uniquebackend.c:44:
  594. /usr/include/gtk-3.0/gtk/gtkstylecontext.h:559: error: expected '=', ',', ';', 'asm' or '__attribute__' before 'GtkWidgetPath'
  595. In file included from /usr/include/gtk-3.0/gtk/gtklabel.h:36,
  596.                  from /usr/include/gtk-3.0/gtk/gtkaccellabel.h:38,
  597.                  from /usr/include/gtk-3.0/gtk/gtk.h:35,
  598.                  from ./uniqueapp.h:27,
  599.                  from ./uniqueapp.c:66:
  600. /usr/include/gtk-3.0/gtk/gtkmenu.h:187: error: expected '=', ',', ';', 'asm' or '__attribute__' before 'gchar'
  601. In file included from /usr/include/gtk-3.0/gtk/gtkcheckmenuitem.h:35,
  602.                  from /usr/include/gtk-3.0/gtk/gtk.h:76,
  603.                  from ./uniqueapp.h:27,
  604.                  from ./uniqueinternals.h:6,
  605.                  from ./uniquemessage.c:30:
  606. /usr/include/gtk-3.0/gtk/gtkmenuitem.h:79: error: expected specifier-qualifier-list before 'G_CONST_RETURN'
  607. In file included from /usr/include/gtk-3.0/gtk/gtkaccellabel.h:38,
  608.                  from /usr/include/gtk-3.0/gtk/gtk.h:35,
  609.                  from ./uniqueapp.h:27,
  610.                  from ./uniqueapp.c:66:
  611. /usr/include/gtk-3.0/gtk/gtklabel.h:96: error: expected '=', ',', ';', 'asm' or '__attribute__' before 'gchar'
  612. /usr/include/gtk-3.0/gtk/gtklabel.h:102: error: expected '=', ',', ';', 'asm' or '__attribute__' before 'gchar'
  613. /usr/include/gtk-3.0/gtk/gtkmenuitem.h:112: error: expected '=', ',', ';', 'asm' or '__attribute__' before 'gchar'
  614. /usr/include/gtk-3.0/gtk/gtkmenuitem.h:116: error: expected '=', ',', ';', 'asm' or '__attribute__' before 'gchar'
  615. /usr/include/gtk-3.0/gtk/gtklabel.h:162: error: expected '=', ',', ';', 'asm' or '__attribute__' before 'gchar'
  616. In file included from /usr/include/gtk-3.0/gtk/gtk.h:78,
  617.                  from ./uniqueapp.h:27,
  618.                  from ./uniqueinternals.h:6,
  619.                  from ./uniquemessage.c:30:
  620. /usr/include/gtk-3.0/gtk/gtkcolorbutton.h:96: error: expected '=', ',', ';', 'asm' or '__attribute__' before 'gchar'
  621. In file included from /usr/include/gtk-3.0/gtk/gtk.h:95,
  622.                  from ./uniqueapp.h:27,
  623.                  from ./uniqueinternals.h:6,
  624.                  from ./uniquemessage.c:30:
  625. /usr/include/gtk-3.0/gtk/gtkexpander.h:85: error: expected '=', ',', ';', 'asm' or '__attribute__' before 'gchar'
  626. In file included from /usr/include/gtk-3.0/gtk/gtkfilechooser.h:28,
  627.                  from /usr/include/gtk-3.0/gtk/gtk.h:97,
  628.                  from ./uniqueapp.h:27,
  629.                  from ./uniqueinternals.h:6,
  630.                  from ./uniquemessage.c:30:
  631. /usr/include/gtk-3.0/gtk/gtkfilefilter.h:99: error: expected '=', ',', ';', 'asm' or '__attribute__' before 'gchar'
  632. In file included from /usr/include/gtk-3.0/gtk/gtk.h:98,
  633.                  from ./uniqueapp.h:27,
  634.                  from ./uniqueinternals.h:6,
  635.                  from ./uniquemessage.c:30:
  636. /usr/include/gtk-3.0/gtk/gtkfilechooserbutton.h:71: error: expected '=', ',', ';', 'asm' or '__attribute__' before 'gchar'
  637. In file included from /usr/include/gtk-3.0/gtk/gtktreeviewcolumn.h:30,
  638.                  from /usr/include/gtk-3.0/gtk/gtktreeview.h:29,
  639.                  from /usr/include/gtk-3.0/gtk/gtkcombobox.h:29,
  640.                  from /usr/include/gtk-3.0/gtk/gtkappchooserbutton.h:31,
  641.                  from /usr/include/gtk-3.0/gtk/gtk.h:46,
  642.                  from ./uniqueapp.h:27,
  643.                  from ./uniqueapp.c:66:
  644. /usr/include/gtk-3.0/gtk/gtkcellarea.h:356: error: expected '=', ',', ';', 'asm' or '__attribute__' before 'gchar'
  645. /usr/include/gtk-3.0/gtk/gtkcellarea.h:435: error: expected '=', ',', ';', 'asm' or '__attribute__' before 'GList'
  646. In file included from /usr/include/gtk-3.0/gtk/gtk.h:102,
  647.                  from ./uniqueapp.h:27,
  648.                  from ./uniqueinternals.h:6,
  649.                  from ./uniquemessage.c:30:
  650. /usr/include/gtk-3.0/gtk/gtkfontbutton.h:78: error: expected '=', ',', ';', 'asm' or '__attribute__' before 'gchar'
  651. In file included from /usr/include/gtk-3.0/gtk/gtktreeview.h:29,
  652.                  from /usr/include/gtk-3.0/gtk/gtkcombobox.h:29,
  653.                  from /usr/include/gtk-3.0/gtk/gtkappchooserbutton.h:31,
  654.                  from /usr/include/gtk-3.0/gtk/gtk.h:46,
  655.                  from ./uniqueapp.h:27,
  656.                  from ./uniqueapp.c:66:
  657. /usr/include/gtk-3.0/gtk/gtktreeviewcolumn.h:163: error: expected '=', ',', ';', 'asm' or '__attribute__' before 'gchar'
  658. /usr/include/gtk-3.0/gtk/gtkfontbutton.h:87: error: expected '=', ',', ';', 'asm' or '__attribute__' before 'gchar'
  659. In file included from /usr/include/gtk-3.0/gtk/gtk.h:103,
  660.                  from ./uniqueapp.h:27,
  661.                  from ./uniqueinternals.h:6,
  662.                  from ./uniquemessage.c:30:
  663. /usr/include/gtk-3.0/gtk/gtkfontsel.h:164: error: expected '=', ',', ';', 'asm' or '__attribute__' before 'gchar'
  664. In file included from /usr/include/gtk-3.0/gtk/gtkentry.h:42,
  665.                  from /usr/include/gtk-3.0/gtk/gtktreeview.h:31,
  666.                  from /usr/include/gtk-3.0/gtk/gtkcombobox.h:29,
  667.                  from /usr/include/gtk-3.0/gtk/gtkappchooserbutton.h:31,
  668.                  from /usr/include/gtk-3.0/gtk/gtk.h:46,
  669.                  from ./uniqueapp.h:27,
  670.                  from ./uniqueapp.c:66:
  671. /usr/include/gtk-3.0/gtk/gtkentrybuffer.h:104: error: expected '=', ',', ';', 'asm' or '__attribute__' before 'gchar'
  672. In file included from /usr/include/gtk-3.0/gtk/gtkentry.h:44,
  673.                  from /usr/include/gtk-3.0/gtk/gtktreeview.h:31,
  674.                  from /usr/include/gtk-3.0/gtk/gtkcombobox.h:29,
  675.                  from /usr/include/gtk-3.0/gtk/gtkappchooserbutton.h:31,
  676.                  from /usr/include/gtk-3.0/gtk/gtk.h:46,
  677.                  from ./uniqueapp.h:27,
  678.                  from ./uniqueapp.c:66:
  679. /usr/include/gtk-3.0/gtk/gtkimage.h:158: error: expected declaration specifiers or '...' before 'G_CONST_RETURN'
  680. In file included from /usr/include/gtk-3.0/gtk/gtk.h:116,
  681.                  from ./uniqueapp.h:27,
  682.                  from ./uniqueinternals.h:6,
  683.                  from ./uniquemessage.c:30:
  684. /usr/include/gtk-3.0/gtk/gtkicontheme.h:177: error: expected '=', ',', ';', 'asm' or '__attribute__' before 'gchar'
  685. /usr/include/gtk-3.0/gtk/gtkicontheme.h:207: error: expected '=', ',', ';', 'asm' or '__attribute__' before 'gchar'
  686. In file included from /usr/include/gtk-3.0/gtk/gtktreeview.h:31,
  687.                  from /usr/include/gtk-3.0/gtk/gtkcombobox.h:29,
  688.                  from /usr/include/gtk-3.0/gtk/gtkappchooserbutton.h:31,
  689.                  from /usr/include/gtk-3.0/gtk/gtk.h:46,
  690.                  from ./uniqueapp.h:27,
  691.                  from ./uniqueapp.c:66:
  692. /usr/include/gtk-3.0/gtk/gtkentry.h:154: error: expected '=', ',', ';', 'asm' or '__attribute__' before 'GtkBorder'
  693. In file included from /usr/include/gtk-3.0/gtk/gtkaction.h:38,
  694.                  from /usr/include/gtk-3.0/gtk/gtkactiongroup.h:38,
  695.                  from /usr/include/gtk-3.0/gtk/gtkapplication.h:29,
  696.                  from /usr/include/gtk-3.0/gtk/gtkwindow.h:35,
  697.                  from /usr/include/gtk-3.0/gtk/gtkdialog.h:35,
  698.                  from /usr/include/gtk-3.0/gtk/gtkaboutdialog.h:32,
  699.                  from /usr/include/gtk-3.0/gtk/gtk.h:33,
  700.                  from ../unique/uniqueapp.h:27,
  701.                  from ./uniquebackend.h:27,
  702.                  from ./uniquebackend.c:44:
  703. /usr/include/gtk-3.0/gtk/gtkwidget.h:580: error: expected '=', ',', ';', 'asm' or '__attribute__' before 'gchar'
  704. /usr/include/gtk-3.0/gtk/gtkentry.h:179: error: expected '=', ',', ';', 'asm' or '__attribute__' before 'gchar'
  705. In file included from /usr/include/gtk-3.0/gtk/gtkactiongroup.h:38,
  706.                  from /usr/include/gtk-3.0/gtk/gtkapplication.h:29,
  707.                  from /usr/include/gtk-3.0/gtk/gtkwindow.h:35,
  708.                  from /usr/include/gtk-3.0/gtk/gtkdialog.h:35,
  709.                  from /usr/include/gtk-3.0/gtk/gtkaboutdialog.h:32,
  710.                  from /usr/include/gtk-3.0/gtk/gtk.h:33,
  711.                  from ../unique/uniqueapp.h:27,
  712.                  from ./uniquebackend.h:27,
  713.                  from ./uniquebackend.c:44:
  714. /usr/include/gtk-3.0/gtk/gtkaction.h:93: error: expected '=', ',', ';', 'asm' or '__attribute__' before 'gchar'
  715. /usr/include/gtk-3.0/gtk/gtkaction.h:111: error: expected '=', ',', ';', 'asm' or '__attribute__' before 'gchar'
  716. /usr/include/gtk-3.0/gtk/gtkaction.h:136: error: expected '=', ',', ';', 'asm' or '__attribute__' before 'gchar'
  717. /usr/include/gtk-3.0/gtk/gtkaction.h:139: error: expected '=', ',', ';', 'asm' or '__attribute__' before 'gchar'
  718. /usr/include/gtk-3.0/gtk/gtkaction.h:142: error: expected '=', ',', ';', 'asm' or '__attribute__' before 'gchar'
  719. /usr/include/gtk-3.0/gtk/gtkaction.h:145: error: expected '=', ',', ';', 'asm' or '__attribute__' before 'gchar'
  720. /usr/include/gtk-3.0/gtk/gtkaction.h:151: error: expected '=', ',', ';', 'asm' or '__attribute__' before 'gchar'
  721. In file included from /usr/include/gtk-3.0/gtk/gtkappchooserbutton.h:31,
  722.                  from /usr/include/gtk-3.0/gtk/gtk.h:46,
  723.                  from ./uniqueapp.h:27,
  724.                  from ./uniqueapp.c:66:
  725. /usr/include/gtk-3.0/gtk/gtkcombobox.h:91: error: expected '=', ',', ';', 'asm' or '__attribute__' before 'gchar'
  726. In file included from /usr/include/gtk-3.0/gtk/gtkapplication.h:29,
  727.                  from /usr/include/gtk-3.0/gtk/gtkwindow.h:35,
  728.                  from /usr/include/gtk-3.0/gtk/gtkdialog.h:35,
  729.                  from /usr/include/gtk-3.0/gtk/gtkaboutdialog.h:32,
  730.                  from /usr/include/gtk-3.0/gtk/gtk.h:33,
  731.                  from ../unique/uniqueapp.h:27,
  732.                  from ./uniquebackend.h:27,
  733.                  from ./uniquebackend.c:44:
  734. /usr/include/gtk-3.0/gtk/gtkactiongroup.h:163: error: expected '=', ',', ';', 'asm' or '__attribute__' before 'gchar'
  735. /usr/include/gtk-3.0/gtk/gtkactiongroup.h:217: error: expected '=', ',', ';', 'asm' or '__attribute__' before 'gchar'
  736. In file included from /usr/include/gtk-3.0/gtk/gtkaspectframe.h:35,
  737.                  from /usr/include/gtk-3.0/gtk/gtk.h:49,
  738.                  from ./uniqueapp.h:27,
  739.                  from ./uniqueapp.c:66:
  740. /usr/include/gtk-3.0/gtk/gtkframe.h:79: error: expected '=', ',', ';', 'asm' or '__attribute__' before 'gchar'
  741. In file included from /usr/include/gtk-3.0/gtk/gtk.h:50,
  742.                  from ./uniqueapp.h:27,
  743.                  from ./uniqueapp.c:66:
  744. /usr/include/gtk-3.0/gtk/gtkassistant.h:154: error: expected '=', ',', ';', 'asm' or '__attribute__' before 'gchar'
  745. In file included from /usr/include/gtk-3.0/gtk/gtk.h:127,
  746.                  from ./uniqueapp.h:27,
  747.                  from ./uniqueinternals.h:6,
  748.                  from ./uniquemessage.c:30:
  749. /usr/include/gtk-3.0/gtk/gtklinkbutton.h:90: error: expected '=', ',', ';', 'asm' or '__attribute__' before 'gchar'
  750. In file included from /usr/include/gtk-3.0/gtk/gtkdialog.h:35,
  751.                  from /usr/include/gtk-3.0/gtk/gtkaboutdialog.h:32,
  752.                  from /usr/include/gtk-3.0/gtk/gtk.h:33,
  753.                  from ../unique/uniqueapp.h:27,
  754.                  from ./uniquebackend.h:27,
  755.                  from ./uniquebackend.c:44:
  756. /usr/include/gtk-3.0/gtk/gtkwindow.h:111: error: expected '=', ',', ';', 'asm' or '__attribute__' before 'gchar'
  757. /usr/include/gtk-3.0/gtk/gtkwindow.h:119: error: expected '=', ',', ';', 'asm' or '__attribute__' before 'gchar'
  758. /usr/include/gtk-3.0/gtk/gtkwindow.h:206: error: expected '=', ',', ';', 'asm' or '__attribute__' before 'gchar'
  759. /usr/include/gtk-3.0/gtk/gtkwindow.h:212: error: expected '=', ',', ';', 'asm' or '__attribute__' before 'gchar'
  760. In file included from /usr/include/gtk-3.0/gtk/gtk.h:33,
  761.                  from ../unique/uniqueapp.h:27,
  762.                  from ./uniquebackend.h:27,
  763.                  from ./uniquebackend.c:44:
  764. /usr/include/gtk-3.0/gtk/gtkaboutdialog.h:115: error: expected '=', ',', ';', 'asm' or '__attribute__' before 'gchar'
  765. /usr/include/gtk-3.0/gtk/gtkaboutdialog.h:118: error: expected '=', ',', ';', 'asm' or '__attribute__' before 'gchar'
  766. /usr/include/gtk-3.0/gtk/gtkaboutdialog.h:121: error: expected '=', ',', ';', 'asm' or '__attribute__' before 'gchar'
  767. /usr/include/gtk-3.0/gtk/gtkaboutdialog.h:124: error: expected '=', ',', ';', 'asm' or '__attribute__' before 'gchar'
  768. /usr/include/gtk-3.0/gtk/gtkaboutdialog.h:127: error: expected '=', ',', ';', 'asm' or '__attribute__' before 'gchar'
  769. /usr/include/gtk-3.0/gtk/gtkaboutdialog.h:138: error: expected '=', ',', ';', 'asm' or '__attribute__' before 'gchar'
  770. In file included from /usr/include/gtk-3.0/gtk/gtk.h:58,
  771.                  from ./uniqueapp.h:27,
  772.                  from ./uniqueapp.c:66:
  773. /usr/include/gtk-3.0/gtk/gtkbutton.h:99: error: expected '=', ',', ';', 'asm' or '__attribute__' before 'gchar'/usr/include/gtk-3.0/gtk/gtkaboutdialog.h:141: error: expected '=', ',', ';', 'asm' or '__attribute__' before 'gchar'
  774.  
  775. /usr/include/gtk-3.0/gtk/gtkaboutdialog.h:144: error: expected '=', ',', ';', 'asm' or '__attribute__' before 'gchar'
  776. /usr/include/gtk-3.0/gtk/gtkaboutdialog.h:147: error: expected '=', ',', ';', 'asm' or '__attribute__' before 'gchar'
  777. /usr/include/gtk-3.0/gtk/gtkaboutdialog.h:150: error: expected '=', ',', ';', 'asm' or '__attribute__' before 'gchar'
  778. /usr/include/gtk-3.0/gtk/gtkaboutdialog.h:153: error: expected '=', ',', ';', 'asm' or '__attribute__' before 'gchar'
  779. /usr/include/gtk-3.0/gtk/gtkaboutdialog.h:159: error: expected '=', ',', ';', 'asm' or '__attribute__' before 'gchar'
  780. In file included from /usr/include/gtk-3.0/gtk/gtkmenutoolbutton.h:30,
  781.                  from /usr/include/gtk-3.0/gtk/gtk.h:134,
  782.                  from ./uniqueapp.h:27,
  783.                  from ./uniqueinternals.h:6,
  784.                  from ./uniquemessage.c:30:
  785. /usr/include/gtk-3.0/gtk/gtktoolbutton.h:76: error: expected '=', ',', ';', 'asm' or '__attribute__' before 'gchar'
  786. /usr/include/gtk-3.0/gtk/gtktoolbutton.h:82: error: expected '=', ',', ';', 'asm' or '__attribute__' before 'gchar'
  787. /usr/include/gtk-3.0/gtk/gtktoolbutton.h:85: error: expected '=', ',', ';', 'asm' or '__attribute__' before 'gchar'
  788. In file included from /usr/include/gtk-3.0/gtk/gtklabel.h:36,
  789.                  from /usr/include/gtk-3.0/gtk/gtkaccellabel.h:38,
  790.                  from /usr/include/gtk-3.0/gtk/gtk.h:35,
  791.                  from ../unique/uniqueapp.h:27,
  792.                  from ./uniquebackend.h:27,
  793.                  from ./uniquebackend.c:44:
  794. /usr/include/gtk-3.0/gtk/gtkmenu.h:187: error: expected '=', ',', ';', 'asm' or '__attribute__' before 'gchar'
  795. In file included from /usr/include/gtk-3.0/gtk/gtkaccellabel.h:38,
  796.                  from /usr/include/gtk-3.0/gtk/gtk.h:35,
  797.                  from ../unique/uniqueapp.h:27,
  798.                  from ./uniquebackend.h:27,
  799.                  from ./uniquebackend.c:44:
  800. /usr/include/gtk-3.0/gtk/gtklabel.h:96: error: expected '=', ',', ';', 'asm' or '__attribute__' before 'gchar'
  801. /usr/include/gtk-3.0/gtk/gtklabel.h:102: error: expected '=', ',', ';', 'asm' or '__attribute__' before 'gchar'
  802. /usr/include/gtk-3.0/gtk/gtklabel.h:162: error: expected '=', ',', ';', 'asm' or '__attribute__' before 'gchar'
  803. In file included from /usr/include/gtk-3.0/gtk/gtk.h:139,
  804.                  from ./uniqueapp.h:27,
  805.                  from ./uniqueinternals.h:6,
  806.                  from ./uniquemessage.c:30:
  807. /usr/include/gtk-3.0/gtk/gtknotebook.h:218: error: expected '=', ',', ';', 'asm' or '__attribute__' before 'gchar'
  808. /usr/include/gtk-3.0/gtk/gtknotebook.h:228: error: expected '=', ',', ';', 'asm' or '__attribute__' before 'gchar'
  809. In file included from /usr/include/gtk-3.0/gtk/gtkpagesetup.h:29,
  810.                  from /usr/include/gtk-3.0/gtk/gtk.h:143,
  811.                  from ./uniqueapp.h:27,
  812.                  from ./uniqueinternals.h:6,
  813.                  from ./uniquemessage.c:30:
  814. /usr/include/gtk-3.0/gtk/gtkpapersize.h:108: error: expected '=', ',', ';', 'asm' or '__attribute__' before 'gchar'
  815. /usr/include/gtk-3.0/gtk/gtkpapersize.h:109: error: expected '=', ',', ';', 'asm' or '__attribute__' before 'gchar'
  816. /usr/include/gtk-3.0/gtk/gtkpapersize.h:110: error: expected '=', ',', ';', 'asm' or '__attribute__' before 'gchar'
  817. /usr/include/gtk-3.0/gtk/gtkpapersize.h:131: error: expected '=', ',', ';', 'asm' or '__attribute__' before 'gchar'
  818. In file included from /usr/include/gtk-3.0/gtk/gtkprintoperation.h:33,
  819.                  from /usr/include/gtk-3.0/gtk/gtk.h:147,
  820.                  from ./uniqueapp.h:27,
  821.                  from ./uniqueinternals.h:6,
  822.                  from ./uniquemessage.c:30:
  823. /usr/include/gtk-3.0/gtk/gtkprintsettings.h:74: error: expected '=', ',', ';', 'asm' or '__attribute__' before 'gchar'
  824. /usr/include/gtk-3.0/gtk/gtkprintsettings.h:148: error: expected '=', ',', ';', 'asm' or '__attribute__' before 'gchar'
  825. /usr/include/gtk-3.0/gtk/gtkprintsettings.h:216: error: expected '=', ',', ';', 'asm' or '__attribute__' before 'gchar'
  826. /usr/include/gtk-3.0/gtk/gtkprintsettings.h:219: error: expected '=', ',', ';', 'asm' or '__attribute__' before 'gchar'
  827. /usr/include/gtk-3.0/gtk/gtkprintsettings.h:222: error: expected '=', ',', ';', 'asm' or '__attribute__' before 'gchar'
  828. /usr/include/gtk-3.0/gtk/gtkprintsettings.h:225: error: expected '=', ',', ';', 'asm' or '__attribute__' before 'gchar'
  829. /usr/include/gtk-3.0/gtk/gtkprintsettings.h:228: error: expected '=', ',', ';', 'asm' or '__attribute__' before 'gchar'
  830. In file included from /usr/include/gtk-3.0/gtk/gtkcheckmenuitem.h:35,
  831.                  from /usr/include/gtk-3.0/gtk/gtk.h:76,
  832.                  from ./uniqueapp.h:27,
  833.                  from ./uniqueapp.c:66:
  834. /usr/include/gtk-3.0/gtk/gtkmenuitem.h:79: error: expected specifier-qualifier-list before 'G_CONST_RETURN'
  835. /usr/include/gtk-3.0/gtk/gtkmenuitem.h:112: error: expected '=', ',', ';', 'asm' or '__attribute__' before 'gchar'
  836. /usr/include/gtk-3.0/gtk/gtkmenuitem.h:116: error: expected '=', ',', ';', 'asm' or '__attribute__' before 'gchar'
  837. In file included from /usr/include/gtk-3.0/gtk/gtk.h:147,
  838.                  from ./uniqueapp.h:27,
  839.                  from ./uniqueinternals.h:6,
  840.                  from ./uniquemessage.c:30:
  841. /usr/include/gtk-3.0/gtk/gtkprintoperation.h:239: error: expected '=', ',', ';', 'asm' or '__attribute__' before 'gchar'
  842. In file included from /usr/include/gtk-3.0/gtk/gtk.h:78,
  843.                  from ./uniqueapp.h:27,
  844.                  from ./uniqueapp.c:66:
  845. /usr/include/gtk-3.0/gtk/gtkcolorbutton.h:96: error: expected '=', ',', ';', 'asm' or '__attribute__' before 'gchar'
  846. In file included from /usr/include/gtk-3.0/gtk/gtk.h:150,
  847.                  from ./uniqueapp.h:27,
  848.                  from ./uniqueinternals.h:6,
  849.                  from ./uniquemessage.c:30:
  850. /usr/include/gtk-3.0/gtk/gtkprogressbar.h:84: error: expected '=', ',', ';', 'asm' or '__attribute__' before 'gchar'
  851. In file included from /usr/include/gtk-3.0/gtk/gtktreeviewcolumn.h:30,
  852.                  from /usr/include/gtk-3.0/gtk/gtktreeview.h:29,
  853.                  from /usr/include/gtk-3.0/gtk/gtkcombobox.h:29,
  854.                  from /usr/include/gtk-3.0/gtk/gtkappchooserbutton.h:31,
  855.                  from /usr/include/gtk-3.0/gtk/gtk.h:46,
  856.                  from ../unique/uniqueapp.h:27,
  857.                  from ./uniquebackend.h:27,
  858.                  from ./uniquebackend.c:44:
  859. /usr/include/gtk-3.0/gtk/gtkcellarea.h:356: error: expected '=', ',', ';', 'asm' or '__attribute__' before 'gchar'
  860. /usr/include/gtk-3.0/gtk/gtkcellarea.h:435: error: expected '=', ',', ';', 'asm' or '__attribute__' before 'GList'
  861. In file included from /usr/include/gtk-3.0/gtk/gtkrecentaction.h:30,
  862.                  from /usr/include/gtk-3.0/gtk/gtk.h:157,
  863.                  from ./uniqueapp.h:27,
  864.                  from ./uniqueinternals.h:6,
  865.                  from ./uniquemessage.c:30:
  866. /usr/include/gtk-3.0/gtk/gtkrecentmanager.h:194: error: expected '=', ',', ';', 'asm' or '__attribute__' before 'gchar'
  867. /usr/include/gtk-3.0/gtk/gtkrecentmanager.h:195: error: expected '=', ',', ';', 'asm' or '__attribute__' before 'gchar'
  868. /usr/include/gtk-3.0/gtk/gtkrecentmanager.h:196: error: expected '=', ',', ';', 'asm' or '__attribute__' before 'gchar'
  869. /usr/include/gtk-3.0/gtk/gtkrecentmanager.h:197: error: expected '=', ',', ';', 'asm' or '__attribute__' before 'gchar'
  870. In file included from /usr/include/gtk-3.0/gtk/gtktreeview.h:29,
  871.                  from /usr/include/gtk-3.0/gtk/gtkcombobox.h:29,
  872.                  from /usr/include/gtk-3.0/gtk/gtkappchooserbutton.h:31,
  873.                  from /usr/include/gtk-3.0/gtk/gtk.h:46,
  874.                  from ../unique/uniqueapp.h:27,
  875.                  from ./uniquebackend.h:27,
  876.                  from ./uniquebackend.c:44:
  877. /usr/include/gtk-3.0/gtk/gtktreeviewcolumn.h:163: error: expected '=', ',', ';', 'asm' or '__attribute__' before 'gchar'
  878. In file included from /usr/include/gtk-3.0/gtk/gtk.h:95,
  879.                  from ./uniqueapp.h:27,
  880.                  from ./uniqueapp.c:66:
  881. /usr/include/gtk-3.0/gtk/gtkexpander.h:85: error: expected '=', ',', ';', 'asm' or '__attribute__' before 'gchar'
  882. In file included from /usr/include/gtk-3.0/gtk/gtkrecentchooser.h:31,
  883.                  from /usr/include/gtk-3.0/gtk/gtk.h:158,
  884.                  from ./uniqueapp.h:27,
  885.                  from ./uniqueinternals.h:6,
  886.                  from ./uniquemessage.c:30:
  887. /usr/include/gtk-3.0/gtk/gtkrecentfilter.h:102: error: expected '=', ',', ';', 'asm' or '__attribute__' before 'gchar'
  888. In file included from /usr/include/gtk-3.0/gtk/gtkfilechooser.h:28,
  889.                  from /usr/include/gtk-3.0/gtk/gtk.h:97,
  890.                  from ./uniqueapp.h:27,
  891.                  from ./uniqueapp.c:66:
  892. /usr/include/gtk-3.0/gtk/gtkfilefilter.h:99: error: expected '=', ',', ';', 'asm' or '__attribute__' before 'gchar'
  893. In file included from /usr/include/gtk-3.0/gtk/gtk.h:98,
  894.                  from ./uniqueapp.h:27,
  895.                  from ./uniqueapp.c:66:
  896. /usr/include/gtk-3.0/gtk/gtkfilechooserbutton.h:71: error: expected '=', ',', ';', 'asm' or '__attribute__' before 'gchar'
  897. In file included from /usr/include/gtk-3.0/gtk/gtk.h:102,
  898.                  from ./uniqueapp.h:27,
  899.                  from ./uniqueapp.c:66:
  900. /usr/include/gtk-3.0/gtk/gtkfontbutton.h:78: error: expected '=', ',', ';', 'asm' or '__attribute__' before 'gchar'
  901. /usr/include/gtk-3.0/gtk/gtkfontbutton.h:87: error: expected '=', ',', ';', 'asm' or '__attribute__' before 'gchar'
  902. In file included from /usr/include/gtk-3.0/gtk/gtk.h:103,
  903.                  from ./uniqueapp.h:27,
  904.                  from ./uniqueapp.c:66:
  905. /usr/include/gtk-3.0/gtk/gtkfontsel.h:164: error: expected '=', ',', ';', 'asm' or '__attribute__' before 'gchar'
  906. In file included from /usr/include/gtk-3.0/gtk/gtkentry.h:42,
  907.                  from /usr/include/gtk-3.0/gtk/gtktreeview.h:31,
  908.                  from /usr/include/gtk-3.0/gtk/gtkcombobox.h:29,
  909.                  from /usr/include/gtk-3.0/gtk/gtkappchooserbutton.h:31,
  910.                  from /usr/include/gtk-3.0/gtk/gtk.h:46,
  911.                  from ../unique/uniqueapp.h:27,
  912.                  from ./uniquebackend.h:27,
  913.                  from ./uniquebackend.c:44:
  914. /usr/include/gtk-3.0/gtk/gtkentrybuffer.h:104: error: expected '=', ',', ';', 'asm' or '__attribute__' before 'gchar'
  915. In file included from /usr/include/gtk-3.0/gtk/gtk.h:180,
  916.                  from ./uniqueapp.h:27,
  917.                  from ./uniqueinternals.h:6,
  918.                  from ./uniquemessage.c:30:
  919. /usr/include/gtk-3.0/gtk/gtkstatusicon.h:105: error: expected '=', ',', ';', 'asm' or '__attribute__' before 'gchar'
  920. /usr/include/gtk-3.0/gtk/gtkstatusicon.h:106: error: expected '=', ',', ';', 'asm' or '__attribute__' before 'gchar'
  921. In file included from /usr/include/gtk-3.0/gtk/gtkentry.h:44,
  922.                  from /usr/include/gtk-3.0/gtk/gtktreeview.h:31,
  923.                  from /usr/include/gtk-3.0/gtk/gtkcombobox.h:29,
  924.                  from /usr/include/gtk-3.0/gtk/gtkappchooserbutton.h:31,
  925.                  from /usr/include/gtk-3.0/gtk/gtk.h:46,
  926.                  from ../unique/uniqueapp.h:27,
  927.                  from ./uniquebackend.h:27,
  928.                  from ./uniquebackend.c:44:
  929. /usr/include/gtk-3.0/gtk/gtkimage.h:158: error: expected declaration specifiers or '...' before 'G_CONST_RETURN'
  930. /usr/include/gtk-3.0/gtk/gtkstatusicon.h:123: error: expected '=', ',', ';', 'asm' or '__attribute__' before 'gchar'
  931. In file included from /usr/include/gtk-3.0/gtk/gtktreeview.h:31,
  932.                  from /usr/include/gtk-3.0/gtk/gtkcombobox.h:29,
  933.                  from /usr/include/gtk-3.0/gtk/gtkappchooserbutton.h:31,
  934.                  from /usr/include/gtk-3.0/gtk/gtk.h:46,
  935.                  from ../unique/uniqueapp.h:27,
  936.                  from ./uniquebackend.h:27,
  937.                  from ./uniquebackend.c:44:
  938. /usr/include/gtk-3.0/gtk/gtkentry.h:154: error: expected '=', ',', ';', 'asm' or '__attribute__' before 'GtkBorder'
  939. /usr/include/gtk-3.0/gtk/gtkentry.h:179: error: expected '=', ',', ';', 'asm' or '__attribute__' before 'gchar'
  940. In file included from /usr/include/gtk-3.0/gtk/gtk.h:116,
  941.                  from ./uniqueapp.h:27,
  942.                  from ./uniqueapp.c:66:
  943. /usr/include/gtk-3.0/gtk/gtkicontheme.h:177: error: expected '=', ',', ';', 'asm' or '__attribute__' before 'gchar'
  944. /usr/include/gtk-3.0/gtk/gtkicontheme.h:207: error: expected '=', ',', ';', 'asm' or '__attribute__' before 'gchar'
  945. In file included from /usr/include/gtk-3.0/gtk/gtkappchooserbutton.h:31,
  946.                  from /usr/include/gtk-3.0/gtk/gtk.h:46,
  947.                  from ../unique/uniqueapp.h:27,
  948.                  from ./uniquebackend.h:27,
  949.                  from ./uniquebackend.c:44:
  950. /usr/include/gtk-3.0/gtk/gtkcombobox.h:91: error: expected '=', ',', ';', 'asm' or '__attribute__' before 'gchar'
  951. In file included from /usr/include/gtk-3.0/gtk/gtkaspectframe.h:35,
  952.                  from /usr/include/gtk-3.0/gtk/gtk.h:49,
  953.                  from ../unique/uniqueapp.h:27,
  954.                  from ./uniquebackend.h:27,
  955.                  from ./uniquebackend.c:44:
  956. /usr/include/gtk-3.0/gtk/gtkframe.h:79: error: expected '=', ',', ';', 'asm' or '__attribute__' before 'gchar'
  957. In file included from /usr/include/gtk-3.0/gtk/gtktextbuffer.h:38,
  958.                  from /usr/include/gtk-3.0/gtk/gtk.h:191,
  959.                  from ./uniqueapp.h:27,
  960.                  from ./uniqueinternals.h:6,
  961.                  from ./uniquemessage.c:30:
  962. /usr/include/gtk-3.0/gtk/gtktextmark.h:96: error: expected '=', ',', ';', 'asm' or '__attribute__' before 'gchar'
  963. In file included from /usr/include/gtk-3.0/gtk/gtk.h:50,
  964.                  from ../unique/uniqueapp.h:27,
  965.                  from ./uniquebackend.h:27,
  966.                  from ./uniquebackend.c:44:
  967. /usr/include/gtk-3.0/gtk/gtkassistant.h:154: error: expected '=', ',', ';', 'asm' or '__attribute__' before 'gchar'
  968. In file included from /usr/include/gtk-3.0/gtk/gtk.h:127,
  969.                  from ./uniqueapp.h:27,
  970.                  from ./uniqueapp.c:66:
  971. /usr/include/gtk-3.0/gtk/gtklinkbutton.h:90: error: expected '=', ',', ';', 'asm' or '__attribute__' before 'gchar'
  972. In file included from /usr/include/gtk-3.0/gtk/gtk.h:58,
  973.                  from ../unique/uniqueapp.h:27,
  974.                  from ./uniquebackend.h:27,
  975.                  from ./uniquebackend.c:44:
  976. /usr/include/gtk-3.0/gtk/gtkbutton.h:99: error: expected '=', ',', ';', 'asm' or '__attribute__' before 'gchar'
  977. In file included from /usr/include/gtk-3.0/gtk/gtk.h:199,
  978.                  from ./uniqueapp.h:27,
  979.                  from ./uniqueinternals.h:6,
  980.                  from ./uniquemessage.c:30:
  981. /usr/include/gtk-3.0/gtk/gtkthemingengine.h:208: error: expected '=', ',', ';', 'asm' or '__attribute__' before 'GtkWidgetPath'
  982. In file included from /usr/include/gtk-3.0/gtk/gtkmenutoolbutton.h:30,
  983.                  from /usr/include/gtk-3.0/gtk/gtk.h:134,
  984.                  from ./uniqueapp.h:27,
  985.                  from ./uniqueapp.c:66:
  986. /usr/include/gtk-3.0/gtk/gtktoolbutton.h:76: error: expected '=', ',', ';', 'asm' or '__attribute__' before 'gchar'
  987. /usr/include/gtk-3.0/gtk/gtktoolbutton.h:82: error: expected '=', ',', ';', 'asm' or '__attribute__' before 'gchar'
  988. /usr/include/gtk-3.0/gtk/gtktoolbutton.h:85: error: expected '=', ',', ';', 'asm' or '__attribute__' before 'gchar'
  989. In file included from /usr/include/gtk-3.0/gtk/gtk.h:206,
  990.                  from ./uniqueapp.h:27,
  991.                  from ./uniqueinternals.h:6,
  992.                  from ./uniquemessage.c:30:
  993. /usr/include/gtk-3.0/gtk/gtktoolitemgroup.h:81: error: expected '=', ',', ';', 'asm' or '__attribute__' before 'gchar'
  994. In file included from /usr/include/gtk-3.0/gtk/gtk.h:139,
  995.                  from ./uniqueapp.h:27,
  996.                  from ./uniqueapp.c:66:
  997. /usr/include/gtk-3.0/gtk/gtknotebook.h:218: error: expected '=', ',', ';', 'asm' or '__attribute__' before 'gchar'
  998. In file included from /usr/include/gtk-3.0/gtk/gtk.h:207,
  999.                  from ./uniqueapp.h:27,
  1000.                  from ./uniqueinternals.h:6,
  1001.                  from ./uniquemessage.c:30:
  1002. /usr/include/gtk-3.0/gtk/gtktoolpalette.h:136: error: expected '=', ',', ';', 'asm' or '__attribute__' before 'GtkTargetEntry'
  1003. /usr/include/gtk-3.0/gtk/gtktoolpalette.h:137: error: expected '=', ',', ';', 'asm' or '__attribute__' before 'GtkTargetEntry'
  1004. /usr/include/gtk-3.0/gtk/gtknotebook.h:228: error: expected '=', ',', ';', 'asm' or '__attribute__' before 'gchar'
  1005. In file included from /usr/include/gtk-3.0/gtk/gtkpagesetup.h:29,
  1006.                  from /usr/include/gtk-3.0/gtk/gtk.h:143,
  1007.                  from ./uniqueapp.h:27,
  1008.                  from ./uniqueapp.c:66:
  1009. /usr/include/gtk-3.0/gtk/gtkpapersize.h:108: error: expected '=', ',', ';', 'asm' or '__attribute__' before 'gchar'
  1010. /usr/include/gtk-3.0/gtk/gtkpapersize.h:109: error: expected '=', ',', ';', 'asm' or '__attribute__' before 'gchar'
  1011. /usr/include/gtk-3.0/gtk/gtkpapersize.h:110: error: expected '=', ',', ';', 'asm' or '__attribute__' before 'gchar'
  1012. /usr/include/gtk-3.0/gtk/gtkpapersize.h:131: error: expected '=', ',', ';', 'asm' or '__attribute__' before 'gchar'
  1013. In file included from /usr/include/gtk-3.0/gtk/gtkprintoperation.h:33,
  1014.                  from /usr/include/gtk-3.0/gtk/gtk.h:147,
  1015.                  from ./uniqueapp.h:27,
  1016.                  from ./uniqueapp.c:66:
  1017. /usr/include/gtk-3.0/gtk/gtkprintsettings.h:74: error: expected '=', ',', ';', 'asm' or '__attribute__' before 'gchar'
  1018. /usr/include/gtk-3.0/gtk/gtkprintsettings.h:148: error: expected '=', ',', ';', 'asm' or '__attribute__' before 'gchar'
  1019. /usr/include/gtk-3.0/gtk/gtkprintsettings.h:216: error: expected '=', ',', ';', 'asm' or '__attribute__' before 'gchar'
  1020. /usr/include/gtk-3.0/gtk/gtkprintsettings.h:219: error: expected '=', ',', ';', 'asm' or '__attribute__' before 'gchar'
  1021. /usr/include/gtk-3.0/gtk/gtkprintsettings.h:222: error: expected '=', ',', ';', 'asm' or '__attribute__' before 'gchar'
  1022. /usr/include/gtk-3.0/gtk/gtkprintsettings.h:225: error: expected '=', ',', ';', 'asm' or '__attribute__' before 'gchar'
  1023. /usr/include/gtk-3.0/gtk/gtkprintsettings.h:228: error: expected '=', ',', ';', 'asm' or '__attribute__' before 'gchar'
  1024. In file included from /usr/include/gtk-3.0/gtk/gtkcheckmenuitem.h:35,
  1025.                  from /usr/include/gtk-3.0/gtk/gtk.h:76,
  1026.                  from ../unique/uniqueapp.h:27,
  1027.                  from ./uniquebackend.h:27,
  1028.                  from ./uniquebackend.c:44:
  1029. /usr/include/gtk-3.0/gtk/gtkmenuitem.h:79: error: expected specifier-qualifier-list before 'G_CONST_RETURN'
  1030. /usr/include/gtk-3.0/gtk/gtkmenuitem.h:112: error: expected '=', ',', ';', 'asm' or '__attribute__' before 'gchar'
  1031. /usr/include/gtk-3.0/gtk/gtkmenuitem.h:116: error: expected '=', ',', ';', 'asm' or '__attribute__' before 'gchar'
  1032. In file included from /usr/include/gtk-3.0/gtk/gtk.h:147,
  1033.                  from ./uniqueapp.h:27,
  1034.                  from ./uniqueapp.c:66:
  1035. /usr/include/gtk-3.0/gtk/gtkprintoperation.h:239: error: expected '=', ',', ';', 'asm' or '__attribute__' before 'gchar'
  1036. In file included from /usr/include/gtk-3.0/gtk/gtk.h:78,
  1037.                  from ../unique/uniqueapp.h:27,
  1038.                  from ./uniquebackend.h:27,
  1039.                  from ./uniquebackend.c:44:
  1040. /usr/include/gtk-3.0/gtk/gtkcolorbutton.h:96: error: expected '=', ',', ';', 'asm' or '__attribute__' before 'gchar'
  1041. In file included from /usr/include/gtk-3.0/gtk/gtk.h:150,
  1042.                  from ./uniqueapp.h:27,
  1043.                  from ./uniqueapp.c:66:
  1044. /usr/include/gtk-3.0/gtk/gtkprogressbar.h:84: error: expected '=', ',', ';', 'asm' or '__attribute__' before 'gchar'
  1045. In file included from /usr/include/gtk-3.0/gtk/gtkrecentaction.h:30,
  1046.                  from /usr/include/gtk-3.0/gtk/gtk.h:157,
  1047.                  from ./uniqueapp.h:27,
  1048.                  from ./uniqueapp.c:66:
  1049. /usr/include/gtk-3.0/gtk/gtkrecentmanager.h:194: error: expected '=', ',', ';', 'asm' or '__attribute__' before 'gchar'
  1050. /usr/include/gtk-3.0/gtk/gtkrecentmanager.h:195: error: expected '=', ',', ';', 'asm' or '__attribute__' before 'gchar'
  1051. /usr/include/gtk-3.0/gtk/gtkrecentmanager.h:196: error: expected '=', ',', ';', 'asm' or '__attribute__' before 'gchar'
  1052. /usr/include/gtk-3.0/gtk/gtkrecentmanager.h:197: error: expected '=', ',', ';', 'asm' or '__attribute__' before 'gchar'
  1053. In file included from /usr/include/gtk-3.0/gtk/gtkrecentchooser.h:31,
  1054.                  from /usr/include/gtk-3.0/gtk/gtk.h:158,
  1055.                  from ./uniqueapp.h:27,
  1056.                  from ./uniqueapp.c:66:
  1057. /usr/include/gtk-3.0/gtk/gtkrecentfilter.h:102: error: expected '=', ',', ';', 'asm' or '__attribute__' before 'gchar'
  1058. In file included from /usr/include/gtk-3.0/gtk/gtk.h:95,
  1059.                  from ../unique/uniqueapp.h:27,
  1060.                  from ./uniquebackend.h:27,
  1061.                  from ./uniquebackend.c:44:
  1062. /usr/include/gtk-3.0/gtk/gtkexpander.h:85: error: expected '=', ',', ';', 'asm' or '__attribute__' before 'gchar'
  1063. In file included from /usr/include/gtk-3.0/gtk/gtkfilechooser.h:28,
  1064.                  from /usr/include/gtk-3.0/gtk/gtk.h:97,
  1065.                  from ../unique/uniqueapp.h:27,
  1066.                  from ./uniquebackend.h:27,
  1067.                  from ./uniquebackend.c:44:
  1068. /usr/include/gtk-3.0/gtk/gtkfilefilter.h:99: error: expected '=', ',', ';', 'asm' or '__attribute__' before 'gchar'
  1069. In file included from /usr/include/gtk-3.0/gtk/gtk.h:98,
  1070.                  from ../unique/uniqueapp.h:27,
  1071.                  from ./uniquebackend.h:27,
  1072.                  from ./uniquebackend.c:44:
  1073. /usr/include/gtk-3.0/gtk/gtkfilechooserbutton.h:71: error: expected '=', ',', ';', 'asm' or '__attribute__' before 'gchar'
  1074. In file included from /usr/include/gtk-3.0/gtk/gtk.h:102,
  1075.                  from ../unique/uniqueapp.h:27,
  1076.                  from ./uniquebackend.h:27,
  1077.                  from ./uniquebackend.c:44:
  1078. /usr/include/gtk-3.0/gtk/gtkfontbutton.h:78: error: expected '=', ',', ';', 'asm' or '__attribute__' before 'gchar'
  1079. /usr/include/gtk-3.0/gtk/gtkfontbutton.h:87: error: expected '=', ',', ';', 'asm' or '__attribute__' before 'gchar'
  1080. In file included from /usr/include/gtk-3.0/gtk/gtk.h:103,
  1081.                  from ../unique/uniqueapp.h:27,
  1082.                  from ./uniquebackend.h:27,
  1083.                  from ./uniquebackend.c:44:
  1084. /usr/include/gtk-3.0/gtk/gtkfontsel.h:164: error: expected '=', ',', ';', 'asm' or '__attribute__' before 'gchar'
  1085. In file included from /usr/include/gtk-3.0/gtk/gtk.h:180,
  1086.                  from ./uniqueapp.h:27,
  1087.                  from ./uniqueapp.c:66:
  1088. /usr/include/gtk-3.0/gtk/gtkstatusicon.h:105: error: expected '=', ',', ';', 'asm' or '__attribute__' before 'gchar'
  1089. /usr/include/gtk-3.0/gtk/gtkstatusicon.h:106: error: expected '=', ',', ';', 'asm' or '__attribute__' before 'gchar'
  1090. /usr/include/gtk-3.0/gtk/gtkstatusicon.h:123: error: expected '=', ',', ';', 'asm' or '__attribute__' before 'gchar'
  1091. make[4]: *** [uniquemessage.lo] Error 1
  1092. make[4]: *** Waiting for unfinished jobs....
  1093. In file included from /usr/include/gtk-3.0/gtk/gtktextbuffer.h:38,
  1094.                  from /usr/include/gtk-3.0/gtk/gtk.h:191,
  1095.                  from ./uniqueapp.h:27,
  1096.                  from ./uniqueapp.c:66:
  1097. /usr/include/gtk-3.0/gtk/gtktextmark.h:96: error: expected '=', ',', ';', 'asm' or '__attribute__' before 'gchar'
  1098. In file included from /usr/include/gtk-3.0/gtk/gtk.h:116,
  1099.                  from ../unique/uniqueapp.h:27,
  1100.                  from ./uniquebackend.h:27,
  1101.                  from ./uniquebackend.c:44:
  1102. /usr/include/gtk-3.0/gtk/gtkicontheme.h:177: error: expected '=', ',', ';', 'asm' or '__attribute__' before 'gchar'
  1103. /usr/include/gtk-3.0/gtk/gtkicontheme.h:207: error: expected '=', ',', ';', 'asm' or '__attribute__' before 'gchar'
  1104. In file included from /usr/include/gtk-3.0/gtk/gtk.h:199,
  1105.                  from ./uniqueapp.h:27,
  1106.                  from ./uniqueapp.c:66:
  1107. /usr/include/gtk-3.0/gtk/gtkthemingengine.h:208: error: expected '=', ',', ';', 'asm' or '__attribute__' before 'GtkWidgetPath'
  1108. In file included from /usr/include/gtk-3.0/gtk/gtk.h:127,
  1109.                  from ../unique/uniqueapp.h:27,
  1110.                  from ./uniquebackend.h:27,
  1111.                  from ./uniquebackend.c:44:
  1112. /usr/include/gtk-3.0/gtk/gtklinkbutton.h:90: error: expected '=', ',', ';', 'asm' or '__attribute__' before 'gchar'
  1113. In file included from /usr/include/gtk-3.0/gtk/gtk.h:206,
  1114.                  from ./uniqueapp.h:27,
  1115.                  from ./uniqueapp.c:66:
  1116. /usr/include/gtk-3.0/gtk/gtktoolitemgroup.h:81: error: expected '=', ',', ';', 'asm' or '__attribute__' before 'gchar'
  1117. In file included from /usr/include/gtk-3.0/gtk/gtk.h:207,
  1118.                  from ./uniqueapp.h:27,
  1119.                  from ./uniqueapp.c:66:
  1120. /usr/include/gtk-3.0/gtk/gtktoolpalette.h:136: error: expected '=', ',', ';', 'asm' or '__attribute__' before 'GtkTargetEntry'
  1121. /usr/include/gtk-3.0/gtk/gtktoolpalette.h:137: error: expected '=', ',', ';', 'asm' or '__attribute__' before 'GtkTargetEntry'
  1122. In file included from /usr/include/gtk-3.0/gtk/gtkmenutoolbutton.h:30,
  1123.                  from /usr/include/gtk-3.0/gtk/gtk.h:134,
  1124.                  from ../unique/uniqueapp.h:27,
  1125.                  from ./uniquebackend.h:27,
  1126.                  from ./uniquebackend.c:44:
  1127. /usr/include/gtk-3.0/gtk/gtktoolbutton.h:76: error: expected '=', ',', ';', 'asm' or '__attribute__' before 'gchar'
  1128. /usr/include/gtk-3.0/gtk/gtktoolbutton.h:82: error: expected '=', ',', ';', 'asm' or '__attribute__' before 'gchar'
  1129. /usr/include/gtk-3.0/gtk/gtktoolbutton.h:85: error: expected '=', ',', ';', 'asm' or '__attribute__' before 'gchar'
  1130. In file included from /usr/include/gtk-3.0/gtk/gtk.h:139,
  1131.                  from ../unique/uniqueapp.h:27,
  1132.                  from ./uniquebackend.h:27,
  1133.                  from ./uniquebackend.c:44:
  1134. /usr/include/gtk-3.0/gtk/gtknotebook.h:218: error: expected '=', ',', ';', 'asm' or '__attribute__' before 'gchar'
  1135. /usr/include/gtk-3.0/gtk/gtknotebook.h:228: error: expected '=', ',', ';', 'asm' or '__attribute__' before 'gchar'
  1136. In file included from /usr/include/gtk-3.0/gtk/gtkpagesetup.h:29,
  1137.                  from /usr/include/gtk-3.0/gtk/gtk.h:143,
  1138.                  from ../unique/uniqueapp.h:27,
  1139.                  from ./uniquebackend.h:27,
  1140.                  from ./uniquebackend.c:44:
  1141. /usr/include/gtk-3.0/gtk/gtkpapersize.h:108: error: expected '=', ',', ';', 'asm' or '__attribute__' before 'gchar'
  1142. /usr/include/gtk-3.0/gtk/gtkpapersize.h:109: error: expected '=', ',', ';', 'asm' or '__attribute__' before 'gchar'
  1143. /usr/include/gtk-3.0/gtk/gtkpapersize.h:110: error: expected '=', ',', ';', 'asm' or '__attribute__' before 'gchar'
  1144. /usr/include/gtk-3.0/gtk/gtkpapersize.h:131: error: expected '=', ',', ';', 'asm' or '__attribute__' before 'gchar'
  1145. In file included from /usr/include/gtk-3.0/gtk/gtkprintoperation.h:33,
  1146.                  from /usr/include/gtk-3.0/gtk/gtk.h:147,
  1147.                  from ../unique/uniqueapp.h:27,
  1148.                  from ./uniquebackend.h:27,
  1149.                  from ./uniquebackend.c:44:
  1150. /usr/include/gtk-3.0/gtk/gtkprintsettings.h:74: error: expected '=', ',', ';', 'asm' or '__attribute__' before 'gchar'
  1151. /usr/include/gtk-3.0/gtk/gtkprintsettings.h:148: error: expected '=', ',', ';', 'asm' or '__attribute__' before 'gchar'
  1152. /usr/include/gtk-3.0/gtk/gtkprintsettings.h:216: error: expected '=', ',', ';', 'asm' or '__attribute__' before 'gchar'
  1153. /usr/include/gtk-3.0/gtk/gtkprintsettings.h:219: error: expected '=', ',', ';', 'asm' or '__attribute__' before 'gchar'
  1154. /usr/include/gtk-3.0/gtk/gtkprintsettings.h:222: error: expected '=', ',', ';', 'asm' or '__attribute__' before 'gchar'
  1155. /usr/include/gtk-3.0/gtk/gtkprintsettings.h:225: error: expected '=', ',', ';', 'asm' or '__attribute__' before 'gchar'
  1156. /usr/include/gtk-3.0/gtk/gtkprintsettings.h:228: error: expected '=', ',', ';', 'asm' or '__attribute__' before 'gchar'
  1157. In file included from /usr/include/gtk-3.0/gtk/gtk.h:147,
  1158.                  from ../unique/uniqueapp.h:27,
  1159.                  from ./uniquebackend.h:27,
  1160.                  from ./uniquebackend.c:44:
  1161. /usr/include/gtk-3.0/gtk/gtkprintoperation.h:239: error: expected '=', ',', ';', 'asm' or '__attribute__' before 'gchar'
  1162. In file included from /usr/include/gtk-3.0/gtk/gtk.h:150,
  1163.                  from ../unique/uniqueapp.h:27,
  1164.                  from ./uniquebackend.h:27,
  1165.                  from ./uniquebackend.c:44:
  1166. /usr/include/gtk-3.0/gtk/gtkprogressbar.h:84: error: expected '=', ',', ';', 'asm' or '__attribute__' before 'gchar'
  1167. ./uniqueapp.c: In function 'set_startup_id':
  1168. ./uniqueapp.c:188: warning: assignment makes pointer from integer without a cast
  1169. In file included from /usr/include/gtk-3.0/gtk/gtkrecentaction.h:30,
  1170.                  from /usr/include/gtk-3.0/gtk/gtk.h:157,
  1171.                  from ../unique/uniqueapp.h:27,
  1172.                  from ./uniquebackend.h:27,
  1173.                  from ./uniquebackend.c:44:
  1174. /usr/include/gtk-3.0/gtk/gtkrecentmanager.h:194: error: expected '=', ',', ';', 'asm' or '__attribute__' before 'gchar'
  1175. /usr/include/gtk-3.0/gtk/gtkrecentmanager.h:195: error: expected '=', ',', ';', 'asm' or '__attribute__' before 'gchar'
  1176. /usr/include/gtk-3.0/gtk/gtkrecentmanager.h:196: error: expected '=', ',', ';', 'asm' or '__attribute__' before 'gchar'
  1177. /usr/include/gtk-3.0/gtk/gtkrecentmanager.h:197: error: expected '=', ',', ';', 'asm' or '__attribute__' before 'gchar'
  1178. In file included from /usr/include/gtk-3.0/gtk/gtkrecentchooser.h:31,
  1179.                  from /usr/include/gtk-3.0/gtk/gtk.h:158,
  1180.                  from ../unique/uniqueapp.h:27,
  1181.                  from ./uniquebackend.h:27,
  1182.                  from ./uniquebackend.c:44:
  1183. /usr/include/gtk-3.0/gtk/gtkrecentfilter.h:102: error: expected '=', ',', ';', 'asm' or '__attribute__' before 'gchar'
  1184. In file included from /usr/include/gtk-3.0/gtk/gtk.h:180,
  1185.                  from ../unique/uniqueapp.h:27,
  1186.                  from ./uniquebackend.h:27,
  1187.                  from ./uniquebackend.c:44:
  1188. /usr/include/gtk-3.0/gtk/gtkstatusicon.h:105: error: expected '=', ',', ';', 'asm' or '__attribute__' before 'gchar'
  1189. /usr/include/gtk-3.0/gtk/gtkstatusicon.h:106: error: expected '=', ',', ';', 'asm' or '__attribute__' before 'gchar'
  1190. /usr/include/gtk-3.0/gtk/gtkstatusicon.h:123: error: expected '=', ',', ';', 'asm' or '__attribute__' before 'gchar'
  1191. make[4]: *** [uniqueapp.lo] Error 1
  1192. In file included from /usr/include/gtk-3.0/gtk/gtktextbuffer.h:38,
  1193.                  from /usr/include/gtk-3.0/gtk/gtk.h:191,
  1194.                  from ../unique/uniqueapp.h:27,
  1195.                  from ./uniquebackend.h:27,
  1196.                  from ./uniquebackend.c:44:
  1197. /usr/include/gtk-3.0/gtk/gtktextmark.h:96: error: expected '=', ',', ';', 'asm' or '__attribute__' before 'gchar'
  1198. In file included from /usr/include/gtk-3.0/gtk/gtk.h:199,
  1199.                  from ../unique/uniqueapp.h:27,
  1200.                  from ./uniquebackend.h:27,
  1201.                  from ./uniquebackend.c:44:
  1202. /usr/include/gtk-3.0/gtk/gtkthemingengine.h:208: error: expected '=', ',', ';', 'asm' or '__attribute__' before 'GtkWidgetPath'
  1203. In file included from /usr/include/gtk-3.0/gtk/gtk.h:206,
  1204.                  from ../unique/uniqueapp.h:27,
  1205.                  from ./uniquebackend.h:27,
  1206.                  from ./uniquebackend.c:44:
  1207. /usr/include/gtk-3.0/gtk/gtktoolitemgroup.h:81: error: expected '=', ',', ';', 'asm' or '__attribute__' before 'gchar'
  1208. In file included from /usr/include/gtk-3.0/gtk/gtk.h:207,
  1209.                  from ../unique/uniqueapp.h:27,
  1210.                  from ./uniquebackend.h:27,
  1211.                  from ./uniquebackend.c:44:
  1212. /usr/include/gtk-3.0/gtk/gtktoolpalette.h:136: error: expected '=', ',', ';', 'asm' or '__attribute__' before 'GtkTargetEntry'
  1213. /usr/include/gtk-3.0/gtk/gtktoolpalette.h:137: error: expected '=', ',', ';', 'asm' or '__attribute__' before 'GtkTargetEntry'
  1214. make[4]: *** [uniquebackend.lo] Error 1
  1215. make[4]: Leaving directory `/var/tmp/portage/dev-libs/libunique-3.0.2/work/libunique-3.0.2/unique'
  1216. make[3]: *** [all-recursive] Error 1
  1217. make[3]: Leaving directory `/var/tmp/portage/dev-libs/libunique-3.0.2/work/libunique-3.0.2/unique'
  1218. make[2]: *** [all] Error 2
  1219. make[2]: Leaving directory `/var/tmp/portage/dev-libs/libunique-3.0.2/work/libunique-3.0.2/unique'
  1220. make[1]: *** [all-recursive] Error 1
  1221. make[1]: Leaving directory `/var/tmp/portage/dev-libs/libunique-3.0.2/work/libunique-3.0.2'
  1222. make: *** [all] Error 2
  1223.  * ERROR: dev-libs/libunique-3.0.2 failed (compile phase):
  1224.  *   emake failed
  1225.  *
  1226.  * If you need support, post the output of 'emerge --info =dev-libs/libunique-3.0.2',
  1227.  * the complete build log and the output of 'emerge -pqv =dev-libs/libunique-3.0.2'.
  1228.  * The complete build log is located at '/var/log/portage/dev-libs:libunique-3.0.2:20110819-191839.log'.
  1229.  * The ebuild environment file is located at '/var/tmp/portage/dev-libs/libunique-3.0.2/temp/environment'.
  1230.  * S: '/var/tmp/portage/dev-libs/libunique-3.0.2/work/libunique-3.0.2'
clone this paste RAW Paste Data