Pastebin launched a little side project called VERYVIRAL.com, check it out ;-) Want more features on Pastebin? Sign Up, it's FREE!
Guest

mate-file-manager build failure

By: a guest on May 2nd, 2012  |  syntax: None  |  size: 1.00 KB  |  views: 45  |  expires: Never
download  |  raw  |  embed  |  report abuse  |  print
Text below is selected. Please press Ctrl+C to copy to your clipboard. (⌘+C on Mac)
  1.   CC       caja-navigation-window-pane.o
  2. caja-navigation-window-pane.c: In function ‘real_set_active’:
  3. caja-navigation-window-pane.c:69:50: error: ‘CajaWindowPane’ has no member named ‘location_button’
  4. caja-navigation-window-pane.c: In function ‘caja_navigation_window_pane_setup’:
  5. caja-navigation-window-pane.c:727:36: error: ‘CajaNavigationWindowPane’ has no member named ‘navigation_group’
  6. make[4]: *** [caja-navigation-window-pane.o] Error 1
  7. make[4]: Leaving directory `/var/abs/local/yaourtbuild/mate-file-manager/src/mate-file-manager-build/src'
  8. make[3]: *** [all-recursive] Error 1
  9. make[3]: Leaving directory `/var/abs/local/yaourtbuild/mate-file-manager/src/mate-file-manager-build/src'
  10. make[2]: *** [all] Error 2
  11. make[2]: Leaving directory `/var/abs/local/yaourtbuild/mate-file-manager/src/mate-file-manager-build/src'
  12. make[1]: *** [all-recursive] Error 1
  13. make[1]: Leaving directory `/var/abs/local/yaourtbuild/mate-file-manager/src/mate-file-manager-build'
  14. make: *** [all] Error 2