Pastebin launched a little side project called VERYVIRAL.com, check it out ;-) Want more features on Pastebin? Sign Up, it's FREE!
Guest

Untitled

By: a guest on Dec 6th, 2012  |  syntax: None  |  size: 12.97 KB  |  views: 27  |  expires: Never
download  |  raw  |  embed  |  report abuse  |  print
Text below is selected. Please press Ctrl+C to copy to your clipboard. (⌘+C on Mac)
  1. ==> Continue building kwin-effect-pulse ? [Y/n]                                                                                                                                                
  2. ==> -------------------------------------------                                                                                                                                                
  3. ==>                                                                                                                                                                                            
  4. ==> Building and installing package
  5. ==> Making package: kwin-effect-pulse 0.3.1-1 (Thu Dec  6 13:47:42 MSK 2012)
  6. ==> Checking runtime dependencies...
  7. ==> Checking buildtime dependencies...
  8. ==> Retrieving Sources...
  9.   -> Downloading v0.3.1...
  10.   % Total    % Received % Xferd  Average Speed   Time    Time     Time  Current
  11.                                  Dload  Upload   Total   Spent    Left  Speed
  12.   0   178    0     0    0     0      0      0 --:--:-- --:--:-- --:--:--     0
  13. 100   139  100   139    0     0    136      0  0:00:01  0:00:01 --:--:--   891
  14. 100  5428  100  5428    0     0   2269      0  0:00:02  0:00:02 --:--:--  7623
  15. ==> Validating source files with md5sums...
  16.     v0.3.1 ... Passed
  17. ==> Extracting Sources...
  18.   -> Extracting v0.3.1 with bsdtar
  19. ==> Entering fakeroot environment...
  20. ==> Starting build()...
  21. -- The C compiler identification is GNU 4.7.2
  22. -- The CXX compiler identification is GNU 4.7.2
  23. -- Check for working C compiler: /usr/lib/ccache/bin/cc
  24. -- Check for working C compiler: /usr/lib/ccache/bin/cc -- works
  25. -- Detecting C compiler ABI info
  26. -- Detecting C compiler ABI info - done
  27. -- Check for working CXX compiler: /usr/lib/ccache/bin/c++
  28. -- Check for working CXX compiler: /usr/lib/ccache/bin/c++ -- works
  29. -- Detecting CXX compiler ABI info
  30. -- Detecting CXX compiler ABI info - done
  31. -- Looking for Q_WS_X11
  32. -- Looking for Q_WS_X11 - found
  33. -- Looking for Q_WS_WIN
  34. -- Looking for Q_WS_WIN - not found
  35. -- Looking for Q_WS_QWS
  36. -- Looking for Q_WS_QWS - not found
  37. -- Looking for Q_WS_MAC
  38. -- Looking for Q_WS_MAC - not found
  39. -- Found Qt-Version 4.8.4 (using /usr/bin/qmake)
  40. -- Looking for XOpenDisplay in /usr/lib/libX11.so;/usr/lib/libXext.so;/usr/lib/libXft.so;/usr/lib/libXau.so;/usr/lib/libXdmcp.so;/usr/lib/libXpm.so
  41. -- Looking for XOpenDisplay in /usr/lib/libX11.so;/usr/lib/libXext.so;/usr/lib/libXft.so;/usr/lib/libXau.so;/usr/lib/libXdmcp.so;/usr/lib/libXpm.so - found
  42. -- Looking for gethostbyname
  43. -- Looking for gethostbyname - found
  44. -- Looking for connect
  45. -- Looking for connect - found
  46. -- Looking for remove
  47. -- Looking for remove - found
  48. -- Looking for shmat
  49. -- Looking for shmat - found
  50. -- Looking for IceConnectionNumber in ICE
  51. -- Looking for IceConnectionNumber in ICE - found
  52. -- Found X11: /usr/lib/libX11.so
  53. -- Looking for include file pthread.h
  54. -- Looking for include file pthread.h - found
  55. -- Looking for pthread_create
  56. -- Looking for pthread_create - not found
  57. -- Looking for pthread_create in pthreads
  58. -- Looking for pthread_create in pthreads - not found
  59. -- Looking for pthread_create in pthread
  60. -- Looking for pthread_create in pthread - found
  61. -- Found Threads: TRUE  
  62. -- Found OpenSSL: /usr/lib/libssl.so
  63. -- Looking for _POSIX_TIMERS
  64. -- Looking for _POSIX_TIMERS - found
  65. -- Found Automoc4: /usr/bin/automoc4
  66. -- Found Perl: /usr/bin/perl (found version "5.16.2")
  67. -- Found Phonon: /usr/include
  68. -- Performing Test _OFFT_IS_64BIT
  69. -- Performing Test _OFFT_IS_64BIT - Success
  70. -- Performing Test HAVE_FPIE_SUPPORT
  71. -- Performing Test HAVE_FPIE_SUPPORT - Success
  72. -- Performing Test __KDE_HAVE_W_OVERLOADED_VIRTUAL
  73. -- Performing Test __KDE_HAVE_W_OVERLOADED_VIRTUAL - Success
  74. -- Performing Test __KDE_HAVE_GCC_VISIBILITY
  75. -- Performing Test __KDE_HAVE_GCC_VISIBILITY - Success
  76. -- Found KDE 4.9 include dir: /usr/include
  77. -- Found KDE 4.9 library dir: /usr/lib
  78. -- Found the KDE4 kconfig_compiler preprocessor: /usr/bin/kconfig_compiler
  79. -- Found automoc4: /usr/bin/automoc4
  80. -- Found X11: /usr/lib/libX11.so
  81. -- Configuring done
  82. -- Generating done
  83. -- Build files have been written to: /tmp/yaourt-tmp-jason/aur-kwin-effect-pulse/src/jinliu-kwin-effect-pulse-3629908/build
  84. Scanning dependencies of target kcm_kwin4_effect_pulse_automoc
  85. Generating pulse_config.moc
  86. [  0%] Built target kcm_kwin4_effect_pulse_automoc
  87. [ 10%] Generating ui_pulse_config.h
  88. Scanning dependencies of target kcm_kwin4_effect_pulse
  89. [ 20%] Building CXX object CMakeFiles/kcm_kwin4_effect_pulse.dir/kcm_kwin4_effect_pulse_automoc.o
  90. [ 30%] Building CXX object CMakeFiles/kcm_kwin4_effect_pulse.dir/pulse_config.o                                
  91. Linking CXX shared module lib/kcm_kwin4_effect_pulse.so
  92. [ 30%] Built target kcm_kwin4_effect_pulse
  93. Scanning dependencies of target kcm_kwin4_effect_scaleout_automoc
  94. Generating scaleout_config.moc
  95. [ 30%] Built target kcm_kwin4_effect_scaleout_automoc
  96. [ 40%] Generating ui_scaleout_config.h
  97. Scanning dependencies of target kcm_kwin4_effect_scaleout
  98. [ 50%] Building CXX object CMakeFiles/kcm_kwin4_effect_scaleout.dir/kcm_kwin4_effect_scaleout_automoc.o
  99. [ 60%] Building CXX object CMakeFiles/kcm_kwin4_effect_scaleout.dir/scaleout_config.o                          
  100. Linking CXX shared module lib/kcm_kwin4_effect_scaleout.so
  101. [ 60%] Built target kcm_kwin4_effect_scaleout
  102. Scanning dependencies of target kwin4_effect_pulse_automoc
  103. [ 60%] Built target kwin4_effect_pulse_automoc
  104. Scanning dependencies of target kwin4_effect_pulse
  105. [ 70%] Building CXX object CMakeFiles/kwin4_effect_pulse.dir/kwin4_effect_pulse_automoc.o
  106. [ 80%] Building CXX object CMakeFiles/kwin4_effect_pulse.dir/pulse.o                                            
  107. In file included from /tmp/yaourt-tmp-jason/aur-kwin-effect-pulse/src/jinliu-kwin-effect-pulse-3629908/pulse.cpp:18:0:
  108. /tmp/yaourt-tmp-jason/aur-kwin-effect-pulse/src/jinliu-kwin-effect-pulse-3629908/pulse.h:43:53: error: ‘TimeLine’ was not declared in this scope
  109. /tmp/yaourt-tmp-jason/aur-kwin-effect-pulse/src/jinliu-kwin-effect-pulse-3629908/pulse.h:43:61: error: template argument 2 is invalid
  110. /tmp/yaourt-tmp-jason/aur-kwin-effect-pulse/src/jinliu-kwin-effect-pulse-3629908/pulse.h:43:63: error: template argument 2 is invalid
  111. /tmp/yaourt-tmp-jason/aur-kwin-effect-pulse/src/jinliu-kwin-effect-pulse-3629908/pulse.cpp: In member function ‘virtual void KWin::PulseEffect::reconfigure(KWin::Effect::ReconfigureFlags)’:
  112. /tmp/yaourt-tmp-jason/aur-kwin-effect-pulse/src/jinliu-kwin-effect-pulse-3629908/pulse.cpp:32:18: error: variable ‘KConfigGroup conf’ has initializer but incomplete type
  113. /tmp/yaourt-tmp-jason/aur-kwin-effect-pulse/src/jinliu-kwin-effect-pulse-3629908/pulse.cpp:32:61: error: invalid use of incomplete type ‘class KConfigGroup’
  114. In file included from /usr/include/kconfig.h:27:0,
  115.                  from /usr/include/ksharedconfig.h:25,
  116.                  from /usr/include/kcomponentdata.h:23,
  117.                  from /usr/include/KDE/../kpluginfactory.h:30,
  118.                  from /usr/include/KDE/KPluginFactory:1,
  119.                  from /usr/include/kwineffects.h:39,
  120.                  from /tmp/yaourt-tmp-jason/aur-kwin-effect-pulse/src/jinliu-kwin-effect-pulse-3629908/pulse.h:21,
  121.                  from /tmp/yaourt-tmp-jason/aur-kwin-effect-pulse/src/jinliu-kwin-effect-pulse-3629908/pulse.cpp:18:
  122. /usr/include/kconfigbase.h:32:7: error: forward declaration of ‘class KConfigGroup’
  123. /tmp/yaourt-tmp-jason/aur-kwin-effect-pulse/src/jinliu-kwin-effect-pulse-3629908/pulse.cpp: In member function ‘virtual void KWin::PulseEffect::prePaintScreen(KWin::ScreenPrePaintData&, int)’:
  124. /tmp/yaourt-tmp-jason/aur-kwin-effect-pulse/src/jinliu-kwin-effect-pulse-3629908/pulse.cpp:43:27: error: request for member ‘isEmpty’ in ‘((KWin::PulseEffect*)this)->KWin::PulseEffect::mTimeLineWindows’, which is of non-class type ‘int’
  125. /tmp/yaourt-tmp-jason/aur-kwin-effect-pulse/src/jinliu-kwin-effect-pulse-3629908/pulse.cpp: In member function ‘virtual void KWin::PulseEffect::prePaintWindow(KWin::EffectWindow*, KWin::WindowPrePaintData&, int)’:
  126. /tmp/yaourt-tmp-jason/aur-kwin-effect-pulse/src/jinliu-kwin-effect-pulse-3629908/pulse.cpp:50:26: error: request for member ‘contains’ in ‘((KWin::PulseEffect*)this)->KWin::PulseEffect::mTimeLineWindows’, which is of non-class type ‘int’
  127. /tmp/yaourt-tmp-jason/aur-kwin-effect-pulse/src/jinliu-kwin-effect-pulse-3629908/pulse.cpp:52:31: error: ‘class KWin::EffectWindow’ has no member named ‘second’
  128. /tmp/yaourt-tmp-jason/aur-kwin-effect-pulse/src/jinliu-kwin-effect-pulse-3629908/pulse.cpp:53:35: error: ‘class KWin::EffectWindow’ has no member named ‘second’
  129. /tmp/yaourt-tmp-jason/aur-kwin-effect-pulse/src/jinliu-kwin-effect-pulse-3629908/pulse.cpp:55:42: error: ‘class KWin::EffectWindow’ has no member named ‘first’
  130. /tmp/yaourt-tmp-jason/aur-kwin-effect-pulse/src/jinliu-kwin-effect-pulse-3629908/pulse.cpp:57:35: error: ‘class KWin::EffectWindow’ has no member named ‘first’
  131. /tmp/yaourt-tmp-jason/aur-kwin-effect-pulse/src/jinliu-kwin-effect-pulse-3629908/pulse.cpp:58:13: error: ‘TimeLine’ was not declared in this scope
  132. /tmp/yaourt-tmp-jason/aur-kwin-effect-pulse/src/jinliu-kwin-effect-pulse-3629908/pulse.cpp:58:23: error: ‘t’ was not declared in this scope
  133. /tmp/yaourt-tmp-jason/aur-kwin-effect-pulse/src/jinliu-kwin-effect-pulse-3629908/pulse.cpp:58:49: error: ‘class KWin::EffectWindow’ has no member named ‘second’
  134. /tmp/yaourt-tmp-jason/aur-kwin-effect-pulse/src/jinliu-kwin-effect-pulse-3629908/pulse.cpp:59:30: error: ‘TimeLine’ is not a class or namespace
  135. /tmp/yaourt-tmp-jason/aur-kwin-effect-pulse/src/jinliu-kwin-effect-pulse-3629908/pulse.cpp:65:30: error: request for member ‘remove’ in ‘((KWin::PulseEffect*)this)->KWin::PulseEffect::mTimeLineWindows’, which is of non-class type ‘int’
  136. /tmp/yaourt-tmp-jason/aur-kwin-effect-pulse/src/jinliu-kwin-effect-pulse-3629908/pulse.cpp: In member function ‘virtual void KWin::PulseEffect::paintWindow(KWin::EffectWindow*, int, QRegion, KWin::WindowPaintData&)’:
  137. /tmp/yaourt-tmp-jason/aur-kwin-effect-pulse/src/jinliu-kwin-effect-pulse-3629908/pulse.cpp:72:26: error: request for member ‘contains’ in ‘((KWin::PulseEffect*)this)->KWin::PulseEffect::mTimeLineWindows’, which is of non-class type ‘int’
  138. /tmp/yaourt-tmp-jason/aur-kwin-effect-pulse/src/jinliu-kwin-effect-pulse-3629908/pulse.cpp:74:37: error: ‘class KWin::EffectWindow’ has no member named ‘first’
  139. /tmp/yaourt-tmp-jason/aur-kwin-effect-pulse/src/jinliu-kwin-effect-pulse-3629908/pulse.cpp:76:50: error: ‘class KWin::EffectWindow’ has no member named ‘second’
  140. /tmp/yaourt-tmp-jason/aur-kwin-effect-pulse/src/jinliu-kwin-effect-pulse-3629908/pulse.cpp:87:56: error: ‘class KWin::EffectWindow’ has no member named ‘second’
  141. /tmp/yaourt-tmp-jason/aur-kwin-effect-pulse/src/jinliu-kwin-effect-pulse-3629908/pulse.cpp:88:57: error: ‘class KWin::EffectWindow’ has no member named ‘second’
  142. /tmp/yaourt-tmp-jason/aur-kwin-effect-pulse/src/jinliu-kwin-effect-pulse-3629908/pulse.cpp: In member function ‘virtual void KWin::PulseEffect::postPaintWindow(KWin::EffectWindow*)’:
  143. /tmp/yaourt-tmp-jason/aur-kwin-effect-pulse/src/jinliu-kwin-effect-pulse-3629908/pulse.cpp:118:26: error: request for member ‘contains’ in ‘((KWin::PulseEffect*)this)->KWin::PulseEffect::mTimeLineWindows’, which is of non-class type ‘int’
  144. /tmp/yaourt-tmp-jason/aur-kwin-effect-pulse/src/jinliu-kwin-effect-pulse-3629908/pulse.cpp: In member function ‘virtual void KWin::PulseEffect::windowAdded(KWin::EffectWindow*)’:
  145. /tmp/yaourt-tmp-jason/aur-kwin-effect-pulse/src/jinliu-kwin-effect-pulse-3629908/pulse.cpp:127:31: error: ‘class KWin::EffectWindow’ has no member named ‘first’
  146. /tmp/yaourt-tmp-jason/aur-kwin-effect-pulse/src/jinliu-kwin-effect-pulse-3629908/pulse.cpp:128:9: error: ‘TimeLine’ was not declared in this scope
  147. /tmp/yaourt-tmp-jason/aur-kwin-effect-pulse/src/jinliu-kwin-effect-pulse-3629908/pulse.cpp:128:19: error: ‘t’ was not declared in this scope
  148. /tmp/yaourt-tmp-jason/aur-kwin-effect-pulse/src/jinliu-kwin-effect-pulse-3629908/pulse.cpp:128:45: error: ‘class KWin::EffectWindow’ has no member named ‘second’
  149. /tmp/yaourt-tmp-jason/aur-kwin-effect-pulse/src/jinliu-kwin-effect-pulse-3629908/pulse.cpp:129:26: error: ‘TimeLine’ is not a class or namespace
  150. /tmp/yaourt-tmp-jason/aur-kwin-effect-pulse/src/jinliu-kwin-effect-pulse-3629908/pulse.cpp: In member function ‘virtual void KWin::PulseEffect::windowClosed(KWin::EffectWindow*)’:
  151. /tmp/yaourt-tmp-jason/aur-kwin-effect-pulse/src/jinliu-kwin-effect-pulse-3629908/pulse.cpp:138:22: error: request for member ‘remove’ in ‘((KWin::PulseEffect*)this)->KWin::PulseEffect::mTimeLineWindows’, which is of non-class type ‘int’
  152. make[2]: *** [CMakeFiles/kwin4_effect_pulse.dir/pulse.o] Error 1
  153. make[1]: *** [CMakeFiles/kwin4_effect_pulse.dir/all] Error 2
  154. make: *** [all] Error 2
  155. ==> ERROR: A failure occurred in build().
  156.     Aborting...
  157. ==> ERROR: Makepkg was unable to build kwin-effect-pulse.
  158. ==> Restart building kwin-effect-pulse ? [y/N]