Want more features on Pastebin? Sign Up, it's FREE!
Guest

Untitled

By: a guest on Aug 19th, 2013  |  syntax: None  |  size: 1.80 KB  |  views: 34  |  expires: Never
download  |  raw  |  embed  |  report abuse  |  print
Text below is selected. Please press Ctrl+C to copy to your clipboard. (⌘+C on Mac)
  1. /usr/bin/ld: /home/jean-louis/Informatique/Rockbox/rbwork/rockbox/buildsim/lib/rbcodec/codecs/codec_crt0.o: Relocations in generic ELF (EM: 40)
  2. /home/jean-louis/Informatique/Rockbox/rbwork/rockbox/buildsim/lib/rbcodec/codecs/codec_crt0.o: could not read symbols: File in wrong format
  3. LD shorten.codec
  4. collect2: error: ld returned 1 exit status
  5. /usr/bin/ld: /home/jean-louis/Informatique/Rockbox/rbwork/rockbox/buildsim/lib/rbcodec/codecs/codec_crt0.o: Relocations in generic ELF (EM: 40)
  6. /home/jean-louis/Informatique/Rockbox/rbwork/rockbox/buildsim/lib/rbcodec/codecs/codec_crt0.o: could not read symbols: File in wrong format
  7. collect2: error: ld returned 1 exit status
  8. make: *** [/home/jean-louis/Informatique/Rockbox/rbwork/rockbox/buildsim/lib/rbcodec/codecs/sid.codec] Erreur 1
  9. make: *** Attente des tâches non terminées....
  10. make: *** [/home/jean-louis/Informatique/Rockbox/rbwork/rockbox/buildsim/lib/rbcodec/codecs/aac.codec] Erreur 1
  11. /usr/bin/ld: /home/jean-louis/Informatique/Rockbox/rbwork/rockbox/buildsim/lib/rbcodec/codecs/codec_crt0.o: Relocations in generic ELF (EM: 40)
  12. /home/jean-louis/Informatique/Rockbox/rbwork/rockbox/buildsim/lib/rbcodec/codecs/codec_crt0.o: could not read symbols: File in wrong format
  13. collect2: error: ld returned 1 exit status
  14. make: *** [/home/jean-louis/Informatique/Rockbox/rbwork/rockbox/buildsim/lib/rbcodec/codecs/mod.codec] Erreur 1
  15. /usr/bin/ld: /home/jean-louis/Informatique/Rockbox/rbwork/rockbox/buildsim/lib/rbcodec/codecs/codec_crt0.o: Relocations in generic ELF (EM: 40)
  16. /home/jean-louis/Informatique/Rockbox/rbwork/rockbox/buildsim/lib/rbcodec/codecs/codec_crt0.o: could not read symbols: File in wrong format
  17. collect2: error: ld returned 1 exit status
  18. make: *** [/home/jean-louis/Informatique/Rockbox/rbwork/rockbox/buildsim/lib/rbcodec/codecs/shorten.codec] Erreur 1
clone this paste RAW Paste Data