Pastebin launched a little side project called VERYVIRAL.com, check it out ;-) Want more features on Pastebin? Sign Up, it's FREE!
Guest

Ivanko

By: a guest on Jul 13th, 2009  |  syntax: None  |  size: 5.62 KB  |  views: 99  |  expires: Never
download  |  raw  |  embed  |  report abuse  |  print
Text below is selected. Please press Ctrl+C to copy to your clipboard. (⌘+C on Mac)
  1. In file included from inc/asn-incl.h:21,
  2.                  from src/asn-any.cpp:217:
  3. inc/asn-chartraits.h:5:42: error: bits/fpos.h: No such file or directory
  4. make[1]: *** [src/asn-any.o] Error 1
  5. rfc1155-smi.c: In function Б─≤DEncSimpleSyntaxContentБ─≥:
  6. rfc1155-smi.c:23: warning: unused variable Б─≤componentБ─≥
  7. rfc1155-smi.c:22: warning: unused variable Б─≤listLenБ─≥
  8. rfc1155-smi.c: At top level:
  9. rfc1155-smi.c:52: error: expected identifier or Б─≤(Б─≥ before Б─≤{Б─≥ token
  10. rfc1155-smi.c: In function Б─≤FreeSimpleSyntaxБ─≥:
  11. rfc1155-smi.c:123: warning: enumeration value Б─≤SIMPLESYNTAX_NUMBERБ─≥ not handled in switch
  12. rfc1155-smi.c:123: warning: enumeration value Б─≤SIMPLESYNTAX_EMPTYБ─≥ not handled in switch
  13. rfc1155-smi.c: In function Б─≤DEncNetworkAddressContentБ─≥:
  14. rfc1155-smi.c:151: error: Б─≤v_idБ─≥ undeclared (first use in this function)
  15. rfc1155-smi.c:151: error: (Each undeclared identifier is reported only once
  16. rfc1155-smi.c:151: error: for each function it appears in.)
  17. rfc1155-smi.c:151: error: too many arguments to function Б─≤BEncAsnOctsContentБ─≥
  18. rfc1155-smi.c:146: warning: unused variable Б─≤componentБ─≥
  19. rfc1155-smi.c:145: warning: unused variable Б─≤listLenБ─≥
  20. rfc1155-smi.c: At top level:
  21. rfc1155-smi.c:160: error: expected identifier or Б─≤(Б─≥ before Б─≤{Б─≥ token
  22. rfc1155-smi.c: In function Б─≤DEncApplicationSyntaxContentБ─≥:
  23. rfc1155-smi.c:222: error: Б─≤v_idБ─≥ undeclared (first use in this function)
  24. rfc1155-smi.c:222: error: too many arguments to function Б─≤DEncNetworkAddressContentБ─≥
  25. rfc1155-smi.c:227: error: too many arguments to function Б─≤BEncAsnIntContentБ─≥
  26. rfc1155-smi.c:232: error: too many arguments to function Б─≤BEncAsnIntContentБ─≥
  27. rfc1155-smi.c:237: error: too many arguments to function Б─≤BEncAsnIntContentБ─≥
  28. rfc1155-smi.c:242: error: too many arguments to function Б─≤BEncAsnOctsContentБ─≥
  29. rfc1155-smi.c:217: warning: unused variable Б─≤componentБ─≥
  30. rfc1155-smi.c:216: warning: unused variable Б─≤listLenБ─≥
  31. rfc1155-smi.c: At top level:
  32. rfc1155-smi.c:251: error: expected identifier or Б─≤(Б─≥ before Б─≤{Б─≥ token
  33. rfc1155-smi.c: In function Б─≤FreeApplicationSyntaxБ─≥:
  34. rfc1155-smi.c:332: warning: enumeration value Б─≤APPLICATIONSYNTAX_COUNTERБ─≥ not handled in switch
  35. rfc1155-smi.c:332: warning: enumeration value Б─≤APPLICATIONSYNTAX_GAUGEБ─≥ not handled in switch
  36. rfc1155-smi.c:332: warning: enumeration value Б─≤APPLICATIONSYNTAX_TICKSБ─≥ not handled in switch
  37. rfc1155-smi.c: In function Б─≤DEncObjectSyntaxContentБ─≥:
  38. rfc1155-smi.c:360: error: Б─≤v_idБ─≥ undeclared (first use in this function)
  39. rfc1155-smi.c:360: error: too many arguments to function Б─≤DEncSimpleSyntaxContentБ─≥
  40. rfc1155-smi.c:365: error: too many arguments to function Б─≤DEncApplicationSyntaxContentБ─≥
  41. rfc1155-smi.c:355: warning: unused variable Б─≤componentБ─≥
  42. rfc1155-smi.c:354: warning: unused variable Б─≤listLenБ─≥
  43. rfc1155-smi.c: At top level:
  44. rfc1155-smi.c:374: error: expected identifier or Б─≤(Б─≥ before Б─≤{Б─≥ token
  45. make[3]: *** [rfc1155-smi.o] Error 1
  46. make[2]: *** [all] Error 2
  47. make[1]: *** [all] Error 2
  48. In file included from ../../c++-lib/inc/asn-incl.h:21,
  49.                  from rfc1155-smi.h:12,
  50.                  from rfc1155-smi.cpp:9:
  51. ../../c++-lib/inc/asn-chartraits.h:5:42: error: bits/fpos.h: No such file or directory
  52. In file included from rfc1155-smi.h:13,
  53.                  from rfc1155-smi.cpp:9:
  54. ../../c++-lib/inc/asn-listset.h: In member function &#1041;&#9472;&#8804;typename std::list<T, std::allocator<_CharT> >::iterator AsnList<T>::append(const T&)&#1041;&#9472;&#8805;:
  55. ../../c++-lib/inc/asn-listset.h:24: error: there are no arguments to &#1041;&#9472;&#8804;end&#1041;&#9472;&#8805; that depend on a template parameter, so a declaration of &#1041;&#9472;&#8804;end&#1041;&#9472;&#8805; must bblevailaa
  56. ../../c++-lib/inc/asn-listset.h:24: note: (if you use &#1041;&#9472;&#8804;-fpermissive&#1041;&#9472;&#8805;, G++ will accept your code, but allowing the use of an undeclared name is depred)tee
  57. ../../c++-lib/inc/asn-listset.h: In member function &#1041;&#9472;&#8804;virtual void AsnList<T>::Clear()&#1041;&#9472;&#8805;:
  58. ../../c++-lib/inc/asn-listset.h:50: error: there are no arguments to &#1041;&#9472;&#8804;clear&#1041;&#9472;&#8805; that depend on a template parameter, so a declaration of &#1041;&#9472;&#8804;clear&#1041;&#9472;&#8805; muailablevv