Pastebin launched a little side project called VERYVIRAL.com, check it out ;-) Want more features on Pastebin? Sign Up, it's FREE!
Guest

Untitled

By: a guest on Apr 21st, 2011  |  syntax: None  |  size: 27.55 KB  |  views: 128  |  expires: Never
download  |  raw  |  embed  |  report abuse  |  print
Text below is selected. Please press Ctrl+C to copy to your clipboard. (⌘+C on Mac)
  1. [ 71%] Building CXX object src/cc/tools/CMakeFiles/tools.dir/KfsPwd.o
  2. [ 71%] Building CXX object src/cc/tools/CMakeFiles/tools.dir/KfsAppend.o
  3. [ 72%] Building CXX object src/cc/tools/CMakeFiles/tools.dir/KfsToolsCommon.o
  4. [ 72%] Building CXX object src/cc/tools/CMakeFiles/tools.dir/utils.o
  5. Linking CXX static library libtools.a
  6. [ 72%] Built target tools
  7. Scanning dependencies of target cpfromkfs
  8. [ 72%] Building CXX object src/cc/tools/CMakeFiles/cpfromkfs.dir/cpfromkfs_main.o
  9. Linking CXX executable cpfromkfs
  10. /usr/lib/gcc/x86_64-unknown-linux-gnu/4.6.0/../../../../lib/libboost_regex.a(icu.o): In function `_ZNK5boost16icu_regex_traits3toiERPKiS2_i.clone.30':
  11. (.text+0x53): undefined reference to `u_digit_46'
  12. /usr/lib/gcc/x86_64-unknown-linux-gnu/4.6.0/../../../../lib/libboost_regex.a(icu.o): In function `_ZNK5boost16icu_regex_traits3toiERPKiS2_i.clone.30':
  13. (.text+0xcd): undefined reference to `u_digit_46'
  14. /usr/lib/gcc/x86_64-unknown-linux-gnu/4.6.0/../../../../lib/libboost_regex.a(icu.o): In function `boost::icu_regex_traits::isctype(int, unsigned long) const':
  15. (.text+0x2f6): undefined reference to `u_charType_46'
  16. /usr/lib/gcc/x86_64-unknown-linux-gnu/4.6.0/../../../../lib/libboost_regex.a(icu.o): In function `boost::icu_regex_traits::isctype(int, unsigned long) const':
  17. (.text+0x435): undefined reference to `u_isspace_46'
  18. /usr/lib/gcc/x86_64-unknown-linux-gnu/4.6.0/../../../../lib/libboost_regex.a(icu.o): In function `boost::icu_regex_traits::isctype(int, unsigned long) const':
  19. (.text+0x46b): undefined reference to `u_isblank_46'
  20. /usr/lib/gcc/x86_64-unknown-linux-gnu/4.6.0/../../../../lib/libboost_regex.a(icu.o): In function `boost::icu_regex_traits::isctype(int, unsigned long) const':
  21. (.text+0x489): undefined reference to `u_isspace_46'
  22. /usr/lib/gcc/x86_64-unknown-linux-gnu/4.6.0/../../../../lib/libboost_regex.a(icu.o): In function `boost::icu_regex_traits::isctype(int, unsigned long) const':
  23. (.text+0x4c6): undefined reference to `u_digit_46'
  24. /usr/lib/gcc/x86_64-unknown-linux-gnu/4.6.0/../../../../lib/libboost_regex.a(icu.o): In function `boost::icu_regex_traits::lookup_classname(int const*, int const*) const':
  25. (.text+0x7a0): undefined reference to `u_tolower_46'
  26. /usr/lib/gcc/x86_64-unknown-linux-gnu/4.6.0/../../../../lib/libboost_regex.a(icu.o): In function `boost::icu_regex_traits::lookup_classname(int const*, int const*) const':
  27. (.text+0x7b3): undefined reference to `u_isspace_46'
  28. /usr/lib/gcc/x86_64-unknown-linux-gnu/4.6.0/../../../../lib/libboost_regex.a(icu.o): In function `boost::icu_regex_traits::lookup_classname(int const*, int const*) const':
  29. (.text+0x7dd): undefined reference to `u_tolower_46'
  30. /usr/lib/gcc/x86_64-unknown-linux-gnu/4.6.0/../../../../lib/libboost_regex.a(icu.o): In function `boost::icu_regex_traits::lookup_collatename(int const*, int const*) const':
  31. (.text+0xa98): undefined reference to `u_charFromName_46'
  32. /usr/lib/gcc/x86_64-unknown-linux-gnu/4.6.0/../../../../lib/libboost_regex.a(icu.o): In function `boost::icu_regex_traits::lookup_collatename(int const*, int const*) const':
  33. (.text+0xac9): undefined reference to `u_charFromName_46'
  34. /usr/lib/gcc/x86_64-unknown-linux-gnu/4.6.0/../../../../lib/libboost_regex.a(icu.o): In function `boost::detail::sp_counted_impl_p<boost::re_detail::icu_regex_traits_implementation>::dispose()':
  35. (.text._ZN5boost6detail17sp_counted_impl_pINS_9re_detail31icu_regex_traits_implementationEE7disposeEv[boost::detail::sp_counted_impl_p<boost::re_detail::icu_regex_traits_implementation>::dispose()]+0x36): undefined reference to `icu_46::Locale::~Locale()'
  36. /usr/lib/gcc/x86_64-unknown-linux-gnu/4.6.0/../../../../lib/libboost_regex.a(icu.o): In function `boost::detail::sp_counted_impl_p<boost::re_detail::icu_regex_traits_implementation>::dispose()':
  37. (.text._ZN5boost6detail17sp_counted_impl_pINS_9re_detail31icu_regex_traits_implementationEE7disposeEv[boost::detail::sp_counted_impl_p<boost::re_detail::icu_regex_traits_implementation>::dispose()]+0x5f): undefined reference to `icu_46::Locale::~Locale()'
  38. /usr/lib/gcc/x86_64-unknown-linux-gnu/4.6.0/../../../../lib/libboost_regex.a(icu.o): In function `boost::re_detail::perl_matcher<int const*, std::allocator<boost::sub_match<int const*> >, boost::icu_regex_traits>::match_literal()':
  39. (.text._ZN5boost9re_detail12perl_matcherIPKiSaINS_9sub_matchIS3_EEENS_16icu_regex_traitsEE13match_literalEv[boost::re_detail::perl_matcher<int const*, std::allocator<boost::sub_match<int const*> >, boost::icu_regex_traits>::match_literal()]+0x3b): undefined reference to `u_tolower_46'
  40. /usr/lib/gcc/x86_64-unknown-linux-gnu/4.6.0/../../../../lib/libboost_regex.a(icu.o): In function `boost::re_detail::perl_matcher<int const*, std::allocator<boost::sub_match<int const*> >, boost::icu_regex_traits>::unwind_short_set_repeat(bool)':
  41. (.text._ZN5boost9re_detail12perl_matcherIPKiSaINS_9sub_matchIS3_EEENS_16icu_regex_traitsEE23unwind_short_set_repeatEb[boost::re_detail::perl_matcher<int const*, std::allocator<boost::sub_match<int const*> >, boost::icu_regex_traits>::unwind_short_set_repeat(bool)]+0x8f): undefined reference to `u_tolower_46'
  42. /usr/lib/gcc/x86_64-unknown-linux-gnu/4.6.0/../../../../lib/libboost_regex.a(icu.o): In function `boost::re_detail::perl_matcher<int const*, std::allocator<boost::sub_match<int const*> >, boost::icu_regex_traits>::unwind_char_repeat(bool)':
  43. (.text._ZN5boost9re_detail12perl_matcherIPKiSaINS_9sub_matchIS3_EEENS_16icu_regex_traitsEE18unwind_char_repeatEb[boost::re_detail::perl_matcher<int const*, std::allocator<boost::sub_match<int const*> >, boost::icu_regex_traits>::unwind_char_repeat(bool)]+0x8e): undefined reference to `u_tolower_46'
  44. /usr/lib/gcc/x86_64-unknown-linux-gnu/4.6.0/../../../../lib/libboost_regex.a(icu.o): In function `boost::re_detail::perl_matcher<int const*, std::allocator<boost::sub_match<int const*> >, boost::icu_regex_traits>::match_set()':
  45. (.text._ZN5boost9re_detail12perl_matcherIPKiSaINS_9sub_matchIS3_EEENS_16icu_regex_traitsEE9match_setEv[boost::re_detail::perl_matcher<int const*, std::allocator<boost::sub_match<int const*> >, boost::icu_regex_traits>::match_set()]+0x63): undefined reference to `u_tolower_46'
  46. /usr/lib/gcc/x86_64-unknown-linux-gnu/4.6.0/../../../../lib/libboost_regex.a(icu.o): In function `boost::re_detail::perl_matcher<int const*, std::allocator<boost::sub_match<int const*> >, boost::icu_regex_traits>::match_combining()':
  47. (.text._ZN5boost9re_detail12perl_matcherIPKiSaINS_9sub_matchIS3_EEENS_16icu_regex_traitsEE15match_combiningEv[boost::re_detail::perl_matcher<int const*, std::allocator<boost::sub_match<int const*> >, boost::icu_regex_traits>::match_combining()]+0x3f): undefined reference to `u_tolower_46'
  48. /usr/lib/gcc/x86_64-unknown-linux-gnu/4.6.0/../../../../lib/libboost_regex.a(icu.o):(.text._ZN5boost9re_detail12perl_matcherIPKiSaINS_9sub_matchIS3_EEENS_16icu_regex_traitsEE15match_combiningEv[boost::re_detail::perl_matcher<int const*, std::allocator<boost::sub_match<int const*> >, boost::icu_regex_traits>::match_combining()]+0x69): more undefined references to `u_tolower_46' follow
  49. /usr/lib/gcc/x86_64-unknown-linux-gnu/4.6.0/../../../../lib/libboost_regex.a(icu.o): In function `boost::re_detail::icu_regex_traits_implementation::icu_regex_traits_implementation(icu_46::Locale const&)':
  50. (.text._ZN5boost9re_detail31icu_regex_traits_implementationC2ERKN6icu_466LocaleE[_ZN5boost9re_detail31icu_regex_traits_implementationC5ERKN6icu_466LocaleE]+0x1f): undefined reference to `icu_46::Locale::Locale(icu_46::Locale const&)'
  51. /usr/lib/gcc/x86_64-unknown-linux-gnu/4.6.0/../../../../lib/libboost_regex.a(icu.o): In function `boost::re_detail::icu_regex_traits_implementation::icu_regex_traits_implementation(icu_46::Locale const&)':
  52. (.text._ZN5boost9re_detail31icu_regex_traits_implementationC2ERKN6icu_466LocaleE[_ZN5boost9re_detail31icu_regex_traits_implementationC5ERKN6icu_466LocaleE]+0x48): undefined reference to `icu_46::Collator::createInstance(icu_46::Locale const&, UErrorCode&)'
  53. /usr/lib/gcc/x86_64-unknown-linux-gnu/4.6.0/../../../../lib/libboost_regex.a(icu.o): In function `boost::re_detail::icu_regex_traits_implementation::icu_regex_traits_implementation(icu_46::Locale const&)':
  54. (.text._ZN5boost9re_detail31icu_regex_traits_implementationC2ERKN6icu_466LocaleE[_ZN5boost9re_detail31icu_regex_traits_implementationC5ERKN6icu_466LocaleE]+0xc4): undefined reference to `icu_46::Collator::createInstance(icu_46::Locale const&, UErrorCode&)'
  55. /usr/lib/gcc/x86_64-unknown-linux-gnu/4.6.0/../../../../lib/libboost_regex.a(icu.o): In function `boost::re_detail::icu_regex_traits_implementation::icu_regex_traits_implementation(icu_46::Locale const&)':
  56. (.text._ZN5boost9re_detail31icu_regex_traits_implementationC2ERKN6icu_466LocaleE[_ZN5boost9re_detail31icu_regex_traits_implementationC5ERKN6icu_466LocaleE]+0x179): undefined reference to `icu_46::Locale::~Locale()'
  57. /usr/lib/gcc/x86_64-unknown-linux-gnu/4.6.0/../../../../lib/libboost_regex.a(icu.o): In function `void boost::checked_delete<boost::re_detail::icu_regex_traits_implementation>(boost::re_detail::icu_regex_traits_implementation*)':
  58. (.text._ZN5boost14checked_deleteINS_9re_detail31icu_regex_traits_implementationEEEvPT_[void boost::checked_delete<boost::re_detail::icu_regex_traits_implementation>(boost::re_detail::icu_regex_traits_implementation*)]+0x35): undefined reference to `icu_46::Locale::~Locale()'
  59. /usr/lib/gcc/x86_64-unknown-linux-gnu/4.6.0/../../../../lib/libboost_regex.a(icu.o): In function `void boost::checked_delete<boost::re_detail::icu_regex_traits_implementation>(boost::re_detail::icu_regex_traits_implementation*)':
  60. (.text._ZN5boost14checked_deleteINS_9re_detail31icu_regex_traits_implementationEEEvPT_[void boost::checked_delete<boost::re_detail::icu_regex_traits_implementation>(boost::re_detail::icu_regex_traits_implementation*)]+0x5f): undefined reference to `icu_46::Locale::~Locale()'
  61. /usr/lib/gcc/x86_64-unknown-linux-gnu/4.6.0/../../../../lib/libboost_regex.a(icu.o): In function `boost::icu_regex_traits::icu_regex_traits()':
  62. (.text._ZN5boost16icu_regex_traitsC2Ev[_ZN5boost16icu_regex_traitsC5Ev]+0x1d): undefined reference to `icu_46::Locale::Locale()'
  63. /usr/lib/gcc/x86_64-unknown-linux-gnu/4.6.0/../../../../lib/libboost_regex.a(icu.o): In function `boost::icu_regex_traits::icu_regex_traits()':
  64. (.text._ZN5boost16icu_regex_traitsC2Ev[_ZN5boost16icu_regex_traitsC5Ev]+0x6f): undefined reference to `icu_46::Locale::~Locale()'
  65. /usr/lib/gcc/x86_64-unknown-linux-gnu/4.6.0/../../../../lib/libboost_regex.a(icu.o): In function `boost::icu_regex_traits::icu_regex_traits()':
  66. (.text._ZN5boost16icu_regex_traitsC2Ev[_ZN5boost16icu_regex_traitsC5Ev]+0x9a): undefined reference to `icu_46::Locale::~Locale()'
  67. /usr/lib/gcc/x86_64-unknown-linux-gnu/4.6.0/../../../../lib/libboost_regex.a(icu.o): In function `boost::re_detail::perl_matcher<int const*, std::allocator<boost::sub_match<int const*> >, boost::icu_regex_traits>::match_backref()':
  68. (.text._ZN5boost9re_detail12perl_matcherIPKiSaINS_9sub_matchIS3_EEENS_16icu_regex_traitsEE13match_backrefEv[boost::re_detail::perl_matcher<int const*, std::allocator<boost::sub_match<int const*> >, boost::icu_regex_traits>::match_backref()]+0x2e2): undefined reference to `u_tolower_46'
  69. /usr/lib/gcc/x86_64-unknown-linux-gnu/4.6.0/../../../../lib/libboost_regex.a(icu.o): In function `boost::re_detail::perl_matcher<int const*, std::allocator<boost::sub_match<int const*> >, boost::icu_regex_traits>::match_backref()':
  70. (.text._ZN5boost9re_detail12perl_matcherIPKiSaINS_9sub_matchIS3_EEENS_16icu_regex_traitsEE13match_backrefEv[boost::re_detail::perl_matcher<int const*, std::allocator<boost::sub_match<int const*> >, boost::icu_regex_traits>::match_backref()]+0x2f9): undefined reference to `u_tolower_46'
  71. /usr/lib/gcc/x86_64-unknown-linux-gnu/4.6.0/../../../../lib/libboost_regex.a(icu.o): In function `boost::re_detail::basic_regex_creator<int, boost::icu_regex_traits>::append_literal(int)':
  72. (.text._ZN5boost9re_detail19basic_regex_creatorIiNS_16icu_regex_traitsEE14append_literalEi[boost::re_detail::basic_regex_creator<int, boost::icu_regex_traits>::append_literal(int)]+0x7b): undefined reference to `u_tolower_46'
  73. /usr/lib/gcc/x86_64-unknown-linux-gnu/4.6.0/../../../../lib/libboost_regex.a(icu.o): In function `boost::re_detail::basic_regex_creator<int, boost::icu_regex_traits>::append_literal(int)':
  74. (.text._ZN5boost9re_detail19basic_regex_creatorIiNS_16icu_regex_traitsEE14append_literalEi[boost::re_detail::basic_regex_creator<int, boost::icu_regex_traits>::append_literal(int)]+0xf2): undefined reference to `u_tolower_46'
  75. /usr/lib/gcc/x86_64-unknown-linux-gnu/4.6.0/../../../../lib/libboost_regex.a(icu.o): In function `boost::re_detail::basic_regex_parser<int, boost::icu_regex_traits>::parse_repeat_range(bool)':
  76. (.text._ZN5boost9re_detail18basic_regex_parserIiNS_16icu_regex_traitsEE18parse_repeat_rangeEb[boost::re_detail::basic_regex_parser<int, boost::icu_regex_traits>::parse_repeat_range(bool)]+0xeb): undefined reference to `u_digit_46'
  77. /usr/lib/gcc/x86_64-unknown-linux-gnu/4.6.0/../../../../lib/libboost_regex.a(icu.o): In function `boost::re_detail::basic_regex_parser<int, boost::icu_regex_traits>::parse_repeat_range(bool)':
  78. (.text._ZN5boost9re_detail18basic_regex_parserIiNS_16icu_regex_traitsEE18parse_repeat_rangeEb[boost::re_detail::basic_regex_parser<int, boost::icu_regex_traits>::parse_repeat_range(bool)]+0x474): undefined reference to `u_digit_46'
  79. /usr/lib/gcc/x86_64-unknown-linux-gnu/4.6.0/../../../../lib/libboost_regex.a(icu.o): In function `boost::re_detail::basic_regex_parser<int, boost::icu_regex_traits>::parse_repeat_range(bool)':
  80. (.text._ZN5boost9re_detail18basic_regex_parserIiNS_16icu_regex_traitsEE18parse_repeat_rangeEb[boost::re_detail::basic_regex_parser<int, boost::icu_regex_traits>::parse_repeat_range(bool)]+0x5e9): undefined reference to `u_digit_46'
  81. /usr/lib/gcc/x86_64-unknown-linux-gnu/4.6.0/../../../../lib/libboost_regex.a(icu.o): In function `boost::re_detail::basic_regex_parser<int, boost::icu_regex_traits>::parse_repeat_range(bool)':
  82. (.text._ZN5boost9re_detail18basic_regex_parserIiNS_16icu_regex_traitsEE18parse_repeat_rangeEb[boost::re_detail::basic_regex_parser<int, boost::icu_regex_traits>::parse_repeat_range(bool)]+0x64a): undefined reference to `u_digit_46'
  83. /usr/lib/gcc/x86_64-unknown-linux-gnu/4.6.0/../../../../lib/libboost_regex.a(icu.o): In function `boost::basic_regex<int, boost::icu_regex_traits>::imbue(icu_46::Locale)':
  84. (.text._ZN5boost11basic_regexIiNS_16icu_regex_traitsEE5imbueEN6icu_466LocaleE[boost::basic_regex<int, boost::icu_regex_traits>::imbue(icu_46::Locale)]+0x6b): undefined reference to `icu_46::Locale::Locale()'
  85. /usr/lib/gcc/x86_64-unknown-linux-gnu/4.6.0/../../../../lib/libboost_regex.a(icu.o): In function `boost::basic_regex<int, boost::icu_regex_traits>::imbue(icu_46::Locale)':
  86. (.text._ZN5boost11basic_regexIiNS_16icu_regex_traitsEE5imbueEN6icu_466LocaleE[boost::basic_regex<int, boost::icu_regex_traits>::imbue(icu_46::Locale)]+0x83): undefined reference to `icu_46::Locale::Locale(icu_46::Locale const&)'
  87. /usr/lib/gcc/x86_64-unknown-linux-gnu/4.6.0/../../../../lib/libboost_regex.a(icu.o): In function `boost::basic_regex<int, boost::icu_regex_traits>::imbue(icu_46::Locale)':
  88. (.text._ZN5boost11basic_regexIiNS_16icu_regex_traitsEE5imbueEN6icu_466LocaleE[boost::basic_regex<int, boost::icu_regex_traits>::imbue(icu_46::Locale)]+0xb7): undefined reference to `icu_46::Collator::createInstance(icu_46::Locale const&, UErrorCode&)'
  89. /usr/lib/gcc/x86_64-unknown-linux-gnu/4.6.0/../../../../lib/libboost_regex.a(icu.o): In function `boost::basic_regex<int, boost::icu_regex_traits>::imbue(icu_46::Locale)':
  90. (.text._ZN5boost11basic_regexIiNS_16icu_regex_traitsEE5imbueEN6icu_466LocaleE[boost::basic_regex<int, boost::icu_regex_traits>::imbue(icu_46::Locale)]+0x147): undefined reference to `icu_46::Collator::createInstance(icu_46::Locale const&, UErrorCode&)'
  91. /usr/lib/gcc/x86_64-unknown-linux-gnu/4.6.0/../../../../lib/libboost_regex.a(icu.o): In function `boost::basic_regex<int, boost::icu_regex_traits>::imbue(icu_46::Locale)':
  92. (.text._ZN5boost11basic_regexIiNS_16icu_regex_traitsEE5imbueEN6icu_466LocaleE[boost::basic_regex<int, boost::icu_regex_traits>::imbue(icu_46::Locale)]+0x1f8): undefined reference to `icu_46::Locale::~Locale()'
  93. /usr/lib/gcc/x86_64-unknown-linux-gnu/4.6.0/../../../../lib/libboost_regex.a(icu.o): In function `boost::basic_regex<int, boost::icu_regex_traits>::imbue(icu_46::Locale)':
  94. (.text._ZN5boost11basic_regexIiNS_16icu_regex_traitsEE5imbueEN6icu_466LocaleE[boost::basic_regex<int, boost::icu_regex_traits>::imbue(icu_46::Locale)]+0x2cf): undefined reference to `icu_46::Locale::Locale(icu_46::Locale const&)'
  95. /usr/lib/gcc/x86_64-unknown-linux-gnu/4.6.0/../../../../lib/libboost_regex.a(icu.o): In function `boost::basic_regex<int, boost::icu_regex_traits>::imbue(icu_46::Locale)':
  96. (.text._ZN5boost11basic_regexIiNS_16icu_regex_traitsEE5imbueEN6icu_466LocaleE[boost::basic_regex<int, boost::icu_regex_traits>::imbue(icu_46::Locale)]+0x2ea): undefined reference to `icu_46::Locale::Locale(icu_46::Locale const&)'
  97. /usr/lib/gcc/x86_64-unknown-linux-gnu/4.6.0/../../../../lib/libboost_regex.a(icu.o): In function `boost::basic_regex<int, boost::icu_regex_traits>::imbue(icu_46::Locale)':
  98. (.text._ZN5boost11basic_regexIiNS_16icu_regex_traitsEE5imbueEN6icu_466LocaleE[boost::basic_regex<int, boost::icu_regex_traits>::imbue(icu_46::Locale)]+0x2fb): undefined reference to `icu_46::Locale::Locale(icu_46::Locale const&)'
  99. /usr/lib/gcc/x86_64-unknown-linux-gnu/4.6.0/../../../../lib/libboost_regex.a(icu.o): In function `boost::basic_regex<int, boost::icu_regex_traits>::imbue(icu_46::Locale)':
  100. (.text._ZN5boost11basic_regexIiNS_16icu_regex_traitsEE5imbueEN6icu_466LocaleE[boost::basic_regex<int, boost::icu_regex_traits>::imbue(icu_46::Locale)]+0x313): undefined reference to `icu_46::Locale::Locale(icu_46::Locale const&)'
  101. /usr/lib/gcc/x86_64-unknown-linux-gnu/4.6.0/../../../../lib/libboost_regex.a(icu.o): In function `boost::basic_regex<int, boost::icu_regex_traits>::imbue(icu_46::Locale)':
  102. (.text._ZN5boost11basic_regexIiNS_16icu_regex_traitsEE5imbueEN6icu_466LocaleE[boost::basic_regex<int, boost::icu_regex_traits>::imbue(icu_46::Locale)]+0x33f): undefined reference to `icu_46::Collator::createInstance(icu_46::Locale const&, UErrorCode&)'
  103. /usr/lib/gcc/x86_64-unknown-linux-gnu/4.6.0/../../../../lib/libboost_regex.a(icu.o): In function `boost::basic_regex<int, boost::icu_regex_traits>::imbue(icu_46::Locale)':
  104. (.text._ZN5boost11basic_regexIiNS_16icu_regex_traitsEE5imbueEN6icu_466LocaleE[boost::basic_regex<int, boost::icu_regex_traits>::imbue(icu_46::Locale)]+0x3e3): undefined reference to `icu_46::Locale::~Locale()'
  105. /usr/lib/gcc/x86_64-unknown-linux-gnu/4.6.0/../../../../lib/libboost_regex.a(icu.o): In function `boost::basic_regex<int, boost::icu_regex_traits>::imbue(icu_46::Locale)':
  106. (.text._ZN5boost11basic_regexIiNS_16icu_regex_traitsEE5imbueEN6icu_466LocaleE[boost::basic_regex<int, boost::icu_regex_traits>::imbue(icu_46::Locale)]+0x3f6): undefined reference to `icu_46::Locale::~Locale()'
  107. /usr/lib/gcc/x86_64-unknown-linux-gnu/4.6.0/../../../../lib/libboost_regex.a(icu.o): In function `boost::basic_regex<int, boost::icu_regex_traits>::imbue(icu_46::Locale)':
  108. (.text._ZN5boost11basic_regexIiNS_16icu_regex_traitsEE5imbueEN6icu_466LocaleE[boost::basic_regex<int, boost::icu_regex_traits>::imbue(icu_46::Locale)]+0x44f): undefined reference to `icu_46::Locale::~Locale()'
  109. /usr/lib/gcc/x86_64-unknown-linux-gnu/4.6.0/../../../../lib/libboost_regex.a(icu.o): In function `boost::basic_regex<int, boost::icu_regex_traits>::imbue(icu_46::Locale)':
  110. (.text._ZN5boost11basic_regexIiNS_16icu_regex_traitsEE5imbueEN6icu_466LocaleE[boost::basic_regex<int, boost::icu_regex_traits>::imbue(icu_46::Locale)]+0x463): undefined reference to `icu_46::Locale::~Locale()'
  111. /usr/lib/gcc/x86_64-unknown-linux-gnu/4.6.0/../../../../lib/libboost_regex.a(icu.o): In function `boost::basic_regex<int, boost::icu_regex_traits>::imbue(icu_46::Locale)':
  112. (.text._ZN5boost11basic_regexIiNS_16icu_regex_traitsEE5imbueEN6icu_466LocaleE[boost::basic_regex<int, boost::icu_regex_traits>::imbue(icu_46::Locale)]+0x46b): undefined reference to `icu_46::Locale::~Locale()'
  113. /usr/lib/gcc/x86_64-unknown-linux-gnu/4.6.0/../../../../lib/libboost_regex.a(icu.o):(.text._ZN5boost11basic_regexIiNS_16icu_regex_traitsEE5imbueEN6icu_466LocaleE[boost::basic_regex<int, boost::icu_regex_traits>::imbue(icu_46::Locale)]+0x473): more undefined references to `icu_46::Locale::~Locale()' follow
  114. /usr/lib/gcc/x86_64-unknown-linux-gnu/4.6.0/../../../../lib/libboost_regex.a(icu.o): In function `boost::basic_regex<int, boost::icu_regex_traits>::imbue(icu_46::Locale)':
  115. (.text._ZN5boost11basic_regexIiNS_16icu_regex_traitsEE5imbueEN6icu_466LocaleE[boost::basic_regex<int, boost::icu_regex_traits>::imbue(icu_46::Locale)]+0x4b7): undefined reference to `icu_46::Collator::createInstance(icu_46::Locale const&, UErrorCode&)'
  116. /usr/lib/gcc/x86_64-unknown-linux-gnu/4.6.0/../../../../lib/libboost_regex.a(icu.o): In function `boost::basic_regex<int, boost::icu_regex_traits>::imbue(icu_46::Locale)':
  117. (.text._ZN5boost11basic_regexIiNS_16icu_regex_traitsEE5imbueEN6icu_466LocaleE[boost::basic_regex<int, boost::icu_regex_traits>::imbue(icu_46::Locale)]+0x5d7): undefined reference to `icu_46::Locale::~Locale()'
  118. /usr/lib/gcc/x86_64-unknown-linux-gnu/4.6.0/../../../../lib/libboost_regex.a(icu.o): In function `boost::basic_regex<int, boost::icu_regex_traits>::imbue(icu_46::Locale)':
  119. (.text._ZN5boost11basic_regexIiNS_16icu_regex_traitsEE5imbueEN6icu_466LocaleE[boost::basic_regex<int, boost::icu_regex_traits>::imbue(icu_46::Locale)]+0x5df): undefined reference to `icu_46::Locale::~Locale()'
  120. /usr/lib/gcc/x86_64-unknown-linux-gnu/4.6.0/../../../../lib/libboost_regex.a(icu.o): In function `boost::basic_regex<int, boost::icu_regex_traits>::imbue(icu_46::Locale)':
  121. (.text._ZN5boost11basic_regexIiNS_16icu_regex_traitsEE5imbueEN6icu_466LocaleE[boost::basic_regex<int, boost::icu_regex_traits>::imbue(icu_46::Locale)]+0x6e1): undefined reference to `icu_46::Locale::~Locale()'
  122. /usr/lib/gcc/x86_64-unknown-linux-gnu/4.6.0/../../../../lib/libboost_regex.a(icu.o): In function `boost::re_detail::basic_regex_parser<int, boost::icu_regex_traits>::unescape_character()':
  123. (.text._ZN5boost9re_detail18basic_regex_parserIiNS_16icu_regex_traitsEE18unescape_characterEv[boost::re_detail::basic_regex_parser<int, boost::icu_regex_traits>::unescape_character()]+0x21b): undefined reference to `u_digit_46'
  124. /usr/lib/gcc/x86_64-unknown-linux-gnu/4.6.0/../../../../lib/libboost_regex.a(icu.o): In function `boost::re_detail::basic_regex_parser<int, boost::icu_regex_traits>::unescape_character()':
  125. (.text._ZN5boost9re_detail18basic_regex_parserIiNS_16icu_regex_traitsEE18unescape_characterEv[boost::re_detail::basic_regex_parser<int, boost::icu_regex_traits>::unescape_character()]+0x334): undefined reference to `u_digit_46'
  126. /usr/lib/gcc/x86_64-unknown-linux-gnu/4.6.0/../../../../lib/libboost_regex.a(icu.o): In function `boost::re_detail::basic_regex_parser<int, boost::icu_regex_traits>::unescape_character()':
  127. (.text._ZN5boost9re_detail18basic_regex_parserIiNS_16icu_regex_traitsEE18unescape_characterEv[boost::re_detail::basic_regex_parser<int, boost::icu_regex_traits>::unescape_character()]+0x80f): undefined reference to `u_digit_46'
  128. /usr/lib/gcc/x86_64-unknown-linux-gnu/4.6.0/../../../../lib/libboost_regex.a(icu.o): In function `boost::re_detail::basic_regex_parser<int, boost::icu_regex_traits>::unescape_character()':
  129. (.text._ZN5boost9re_detail18basic_regex_parserIiNS_16icu_regex_traitsEE18unescape_characterEv[boost::re_detail::basic_regex_parser<int, boost::icu_regex_traits>::unescape_character()]+0x99f): undefined reference to `u_digit_46'
  130. /usr/lib/gcc/x86_64-unknown-linux-gnu/4.6.0/../../../../lib/libboost_regex.a(icu.o): In function `boost::re_detail::basic_regex_parser<int, boost::icu_regex_traits>::parse_backref()':
  131. (.text._ZN5boost9re_detail18basic_regex_parserIiNS_16icu_regex_traitsEE13parse_backrefEv[boost::re_detail::basic_regex_parser<int, boost::icu_regex_traits>::parse_backref()]+0x1d): undefined reference to `u_digit_46'
  132. /usr/lib/gcc/x86_64-unknown-linux-gnu/4.6.0/../../../../lib/libboost_regex.a(icu.o):(.text._ZN5boost9re_detail18basic_regex_parserIiNS_16icu_regex_traitsEE13parse_backrefEv[boost::re_detail::basic_regex_parser<int, boost::icu_regex_traits>::parse_backref()]+0x124): more undefined references to `u_digit_46' follow
  133. /usr/lib/gcc/x86_64-unknown-linux-gnu/4.6.0/../../../../lib/libboost_regex.a(icu.o): In function `boost::re_detail::perl_matcher<int const*, std::allocator<boost::sub_match<int const*> >, boost::icu_regex_traits>::match_set_repeat()':
  134. (.text._ZN5boost9re_detail12perl_matcherIPKiSaINS_9sub_matchIS3_EEENS_16icu_regex_traitsEE16match_set_repeatEv[boost::re_detail::perl_matcher<int const*, std::allocator<boost::sub_match<int const*> >, boost::icu_regex_traits>::match_set_repeat()]+0x82): undefined reference to `u_tolower_46'
  135. /usr/lib/gcc/x86_64-unknown-linux-gnu/4.6.0/../../../../lib/libboost_regex.a(icu.o): In function `boost::re_detail::perl_matcher<int const*, std::allocator<boost::sub_match<int const*> >, boost::icu_regex_traits>::match_char_repeat()':
  136. (.text._ZN5boost9re_detail12perl_matcherIPKiSaINS_9sub_matchIS3_EEENS_16icu_regex_traitsEE17match_char_repeatEv[boost::re_detail::perl_matcher<int const*, std::allocator<boost::sub_match<int const*> >, boost::icu_regex_traits>::match_char_repeat()]+0x82): undefined reference to `u_tolower_46'
  137. /usr/lib/gcc/x86_64-unknown-linux-gnu/4.6.0/../../../../lib/libboost_regex.a(icu.o): In function `boost::re_detail::basic_regex_creator<int, boost::icu_regex_traits>::append_set(boost::re_detail::basic_char_set<int, boost::icu_regex_traits> const&, mpl_::bool_<false>*)':
  138. (.text._ZN5boost9re_detail19basic_regex_creatorIiNS_16icu_regex_traitsEE10append_setERKNS0_14basic_char_setIiS2_EEPN4mpl_5bool_ILb0EEE[boost::re_detail::basic_regex_creator<int, boost::icu_regex_traits>::append_set(boost::re_detail::basic_char_set<int, boost::icu_regex_traits> const&, mpl_::bool_<false>*)]+0x17b): undefined reference to `u_tolower_46'
  139. /usr/lib/gcc/x86_64-unknown-linux-gnu/4.6.0/../../../../lib/libboost_regex.a(icu.o): In function `boost::re_detail::basic_regex_creator<int, boost::icu_regex_traits>::append_set(boost::re_detail::basic_char_set<int, boost::icu_regex_traits> const&, mpl_::bool_<false>*)':
  140. (.text._ZN5boost9re_detail19basic_regex_creatorIiNS_16icu_regex_traitsEE10append_setERKNS0_14basic_char_setIiS2_EEPN4mpl_5bool_ILb0EEE[boost::re_detail::basic_regex_creator<int, boost::icu_regex_traits>::append_set(boost::re_detail::basic_char_set<int, boost::icu_regex_traits> const&, mpl_::bool_<false>*)]+0x19a): undefined reference to `u_tolower_46'
  141. /usr/lib/gcc/x86_64-unknown-linux-gnu/4.6.0/../../../../lib/libboost_regex.a(icu.o): In function `boost::re_detail::basic_regex_creator<int, boost::icu_regex_traits>::append_set(boost::re_detail::basic_char_set<int, boost::icu_regex_traits> const&, mpl_::bool_<false>*)':
  142. (.text._ZN5boost9re_detail19basic_regex_creatorIiNS_16icu_regex_traitsEE10append_setERKNS0_14basic_char_setIiS2_EEPN4mpl_5bool_ILb0EEE[boost::re_detail::basic_regex_creator<int, boost::icu_regex_traits>::append_set(boost::re_detail::basic_char_set<int, boost::icu_regex_traits> const&, mpl_::bool_<false>*)]+0x81b): undefined reference to `u_tolower_46'
  143. /usr/lib/gcc/x86_64-unknown-linux-gnu/4.6.0/../../../../lib/libboost_regex.a(icu.o):(.text._ZN5boost9re_detail19basic_regex_creatorIiNS_16icu_regex_traitsEE10append_setERKNS0_14basic_char_setIiS2_EEPN4mpl_5bool_ILb0EEE[boost::re_detail::basic_regex_creator<int, boost::icu_regex_traits>::append_set(boost::re_detail::basic_char_set<int, boost::icu_regex_traits> const&, mpl_::bool_<false>*)]+0x83a): more undefined references to `u_tolower_46' follow
  144. collect2: ld returned 1 exit status
  145. make[2]: *** [src/cc/tools/cpfromkfs] Error 1
  146. make[1]: *** [src/cc/tools/CMakeFiles/cpfromkfs.dir/all] Error 2
  147. make: *** [all] Error 2
  148. ==> ERROR: A failure occurred in build().
  149.     Aborting...