SHARE
TWEET

Untitled

a guest Jul 24th, 2011 97 Never
  1. ==> Building MSP430mspgcc/HIL
  2. cd hardware_access; make all
  3. make[1]: Entering directory `/home.old/ivanovp/build/msp430-jtag/src/build/jtag/hardware_access'
  4. cc -O -Wall -fPIC -DHIL_PPDEV -I ..   -c -o HIL.o HIL.c
  5. HIL.c:20:2: warning: #warning Building for Linux!!! [-Wcpp]
  6. ar rc libHIL.a HIL.o
  7. cc -fPIC -shared  -o libHIL.so HIL.o
  8. make[1]: Leaving directory `/home.old/ivanovp/build/msp430-jtag/src/build/jtag/hardware_access'
  9. cd funclets; make all
  10. make[1]: Entering directory `/home.old/ivanovp/build/msp430-jtag/src/build/jtag/funclets'
  11. msp430-gcc -mmcu=msp430x2121   -c -o eraseFlash.o eraseFlash.S
  12. eraseFlash.S:20:20: fatal error: msp430.h: No such file or directory
  13. compilation terminated.
  14. make[1]: *** [eraseFlash.o] Error 1
  15. make[1]: Leaving directory `/home.old/ivanovp/build/msp430-jtag/src/build/jtag/funclets'
  16. make: *** [funclets] Error 2
  17. ==> ERROR: A failure occurred in build().
  18.     Aborting...
RAW Paste Data
Top