SHARE
TWEET

Untitled

a guest Oct 23rd, 2012 66 Never
  1. config.status: creating PKGBUILD-spl-modules
  2. config.status: creating spl.release
  3. config.status: creating dkms.conf
  4. config.status: creating spl_config.h
  5. config.status: executing depfiles commands
  6. config.status: executing libtool commands
  7. make  all-recursive
  8. make[1]: Entering directory `/home/user/spl/src/spl-0.6.0-rc11'
  9. Making all in module
  10. make[2]: Entering directory `/home/user/spl/src/spl-0.6.0-rc11/module'
  11. make -C /usr/src/linux-3.6.2-1-ARCH SUBDIRS=`pwd`  CONFIG_SPL=m modules
  12. make[3]: Entering directory `/usr/src/linux-3.6.2-1-ARCH'
  13.   CC [M]  /home/user/spl/src/spl-0.6.0-rc11/module/spl/../../module/spl/spl-debug.o
  14.   CC [M]  /home/user/spl/src/spl-0.6.0-rc11/module/spl/../../module/spl/spl-proc.o
  15.   CC [M]  /home/user/spl/src/spl-0.6.0-rc11/module/spl/../../module/spl/spl-kmem.o
  16.   CC [M]  /home/user/spl/src/spl-0.6.0-rc11/module/spl/../../module/spl/spl-thread.o
  17.   CC [M]  /home/user/spl/src/spl-0.6.0-rc11/module/spl/../../module/spl/spl-taskq.o
  18.   CC [M]  /home/user/spl/src/spl-0.6.0-rc11/module/spl/../../module/spl/spl-rwlock.o
  19.   CC [M]  /home/user/spl/src/spl-0.6.0-rc11/module/spl/../../module/spl/spl-vnode.o
  20. /home/user/spl/src/spl-0.6.0-rc11/module/spl/../../module/spl/spl-vnode.c: In function 'vn_remove':
  21. /home/user/spl/src/spl-0.6.0-rc11/module/spl/../../module/spl/spl-vnode.c:327:2: error: implicit declaration of function 'path_lookup' [-Werror=implicit-function-declaration]
  22. cc1: some warnings being treated as errors
  23. make[5]: *** [/home/user/spl/src/spl-0.6.0-rc11/module/spl/../../module/spl/spl-vnode.o] Error 1
  24. make[4]: *** [/home/user/spl/src/spl-0.6.0-rc11/module/spl] Error 2
  25. make[3]: *** [_module_/home/user/spl/src/spl-0.6.0-rc11/module] Error 2
  26. make[3]: Leaving directory `/usr/src/linux-3.6.2-1-ARCH'
  27. make[2]: *** [modules] Error 2
  28. make[2]: Leaving directory `/home/user/spl/src/spl-0.6.0-rc11/module'
  29. make[1]: *** [all-recursive] Error 1
  30. make[1]: Leaving directory `/home/user/spl/src/spl-0.6.0-rc11'
  31. make: *** [all] Error 2
RAW Paste Data
Top