This week only. Pastebin PRO Accounts Christmas Special! Don't miss out!Want more features on Pastebin? Sign Up, it's FREE!
Guest

Untitled

By: a guest on Dec 22nd, 2012  |  syntax: Make  |  size: 2.05 KB  |  views: 29  |  expires: Never
download  |  raw  |  embed  |  report abuse  |  print
Text below is selected. Please press Ctrl+C to copy to your clipboard. (⌘+C on Mac)
  1. An error occured when executing: g++ -o modules/m_ssl_gnutls.so -pipe -fPIC -DPIC -pedantic -Woverloaded-virtual -Wshadow -Wformat=2 -Wmissing-format-attribute -Wall -O2 -g1 -Iinclude -DVERSION_GNUTLS=1.4.1 -Wno-deprecated-declarations -DMODNAME=m_ssl_gnutls.so -fPIC -shared -rdynamic /home/irc2/inspircd/src/modules/m_ssl_gnutls.cpp -Wl,--rpath -Wl,/usr/lib -L/usr/lib -L/usr/lib -lgnutls -lgcrypt
  2. /home/irc2/inspircd/src/modules/m_ssl_gnutls.cpp:165: error: âgnutls_priority_tâ does not name a type
  3. /home/irc2/inspircd/src/modules/m_ssl_gnutls.cpp: In constructor âModuleSSLGnuTLS::ModuleSSLGnuTLS()â:
  4. /home/irc2/inspircd/src/modules/m_ssl_gnutls.cpp:190: error: âpriorityâ was not declared in this scope
  5. /home/irc2/inspircd/src/modules/m_ssl_gnutls.cpp:190: error: âgnutls_priority_initâ was not declared in this scope
  6. /home/irc2/inspircd/src/modules/m_ssl_gnutls.cpp: In member function âvirtual void ModuleSSLGnuTLS::OnModuleRehash(User*, const std::string&)â:
  7. /home/irc2/inspircd/src/modules/m_ssl_gnutls.cpp:345: error: âpriorityâ was not declared in this scope
  8. /home/irc2/inspircd/src/modules/m_ssl_gnutls.cpp:345: error: âgnutls_priority_deinitâ was not declared in this scope
  9. /home/irc2/inspircd/src/modules/m_ssl_gnutls.cpp:352: error: âgnutls_priority_initâ was not declared in this scope
  10. /home/irc2/inspircd/src/modules/m_ssl_gnutls.cpp: In destructor âvirtual ModuleSSLGnuTLS::~ModuleSSLGnuTLS()â:
  11. /home/irc2/inspircd/src/modules/m_ssl_gnutls.cpp:392: error: âpriorityâ was not declared in this scope
  12. /home/irc2/inspircd/src/modules/m_ssl_gnutls.cpp:392: error: âgnutls_priority_deinitâ was not declared in this scope
  13. /home/irc2/inspircd/src/modules/m_ssl_gnutls.cpp: In member function âvoid ModuleSSLGnuTLS::InitSession(StreamSocket*, bool)â:
  14. /home/irc2/inspircd/src/modules/m_ssl_gnutls.cpp:460: error: âpriorityâ was not declared in this scope
  15. /home/irc2/inspircd/src/modules/m_ssl_gnutls.cpp:460: error: âgnutls_priority_setâ was not declared in this scope
  16. make[1]: *** [modules/m_ssl_gnutls.so] Error 1
  17. make: *** [target] Error 2
clone this paste RAW Paste Data