Pastebin launched a little side project called HostCabi.net, check it out ;-)Don't like ads? PRO users don't see any ads ;-)
Guest

pd-extended build error

By: a guest on Jan 3rd, 2013  |  syntax: None  |  size: 5.73 KB  |  hits: 20  |  expires: Never
download  |  raw  |  embed  |  report abuse  |  print
Text below is selected. Please press Ctrl+C to copy to your clipboard. (⌘+C on Mac)
  1. 286: LOOP VECTORIZED.
  2. tcl_widgetbehavior.c:285: note: vectorized 1 loops in function.
  3. swig -v -tcl -o tcl_wrap.c -I/home/smmilut/builds/pd-extended/src/pd-extended/p
  4. d/src tclpd.i
  5. Language subdirectory: tcl
  6. Search paths:
  7.    ./
  8.    /home/smmilut/builds/pd-extended/src/pd-extended/pd/src/
  9.    ./swig_lib/tcl/
  10.    /usr/share/swig/2.0.9/tcl/
  11.    ./swig_lib/
  12.    /usr/share/swig/2.0.9/
  13. Preprocessing...
  14. Starting language-specific parse...
  15. Processing types...
  16. C++ analysis...
  17. Generating wrappers...
  18. /home/smmilut/builds/pd-extended/src/pd-extended/pd/src/m_pd.h:266: Warning 454
  19. : Setting a pointer/reference variable may leak memory.
  20. /home/smmilut/builds/pd-extended/src/pd-extended/pd/src/m_pd.h:267: Warning 454
  21. : Setting a pointer/reference variable may leak memory.
  22. /home/smmilut/builds/pd-extended/src/pd-extended/pd/src/m_pd.h:432: Warning 462
  23. : Unable to set variable of type char []
  24. /home/smmilut/builds/pd-extended/src/pd-extended/pd/src/m_pd.h:433: Warning 462
  25. : Unable to set variable of type char []
  26. /home/smmilut/builds/pd-extended/src/pd-extended/pd/src/m_pd.h:599: Warning 454
  27. : Setting a pointer/reference variable may leak memory.
  28. /home/smmilut/builds/pd-extended/src/pd-extended/pd/src/m_pd.h:653: Warning 454
  29. : Setting a pointer/reference variable may leak memory.
  30. /home/smmilut/builds/pd-extended/src/pd-extended/pd/src/m_pd.h:663: Warning 454
  31. : Setting a pointer/reference variable may leak memory.
  32. /home/smmilut/builds/pd-extended/src/pd-extended/pd/src/m_pd.h:682: Warning 454
  33. : Setting a pointer/reference variable may leak memory.
  34. /home/smmilut/builds/pd-extended/src/pd-extended/pd/src/g_canvas.h:344: Warning
  35.  454: Setting a pointer/reference variable may leak memory.
  36. /home/smmilut/builds/pd-extended/src/pd-extended/pd/src/g_canvas.h:345: Warning
  37.  454: Setting a pointer/reference variable may leak memory.
  38. /home/smmilut/builds/pd-extended/src/pd-extended/pd/src/g_canvas.h:346: Warning
  39.  454: Setting a pointer/reference variable may leak memory.
  40. /home/smmilut/builds/pd-extended/src/pd-extended/pd/src/g_canvas.h:347: Warning
  41.  454: Setting a pointer/reference variable may leak memory.
  42. /home/smmilut/builds/pd-extended/src/pd-extended/pd/src/g_canvas.h:347: Warning
  43.  454: Setting a pointer/reference variable may leak memory.
  44. /home/smmilut/builds/pd-extended/src/pd-extended/pd/src/g_canvas.h:455: Warning
  45.  454: Setting a pointer/reference variable may leak memory.
  46. tclpd.h:39: Warning 454: Setting a pointer/reference variable may leak memory.
  47. tclpd.h:58: Warning 454: Setting a pointer/reference variable may leak memory.
  48.  
  49.  
  50.  
  51. [...]
  52.  
  53.  
  54. tcl_wrap.c:22932:5: warning: passing argument 3 of ‘SWIG_Tcl_ConvertPtr’ from in
  55. compatible pointer type [enabled by default]
  56. tcl_wrap.c:1091:1: note: expected ‘void **’ but argument is of type ‘struct t_te
  57. xt **’
  58. tcl_wrap.c: In function ‘_wrap_guiconnect_new’:
  59. tcl_wrap.c:24546:10: warning: assignment from incompatible pointer type [enabled
  60.  by default]
  61. tcl_wrap.c: At top level:
  62. tcl_wrap.c:24980:1: warning: missing initializer [-Wmissing-field-initializers]
  63. tcl_wrap.c:24980:1: warning: (near initialization for ‘_wrap_class__t_tcl.hashta
  64. ble’) [-Wmissing-field-initializers]
  65. tcl_wrap.c:25342:1: warning: missing initializer [-Wmissing-field-initializers]
  66. tcl_wrap.c:25342:1: warning: (near initialization for ‘_wrap_class__t_proxyinlet
  67. .hashtable’) [-Wmissing-field-initializers]
  68. tcl_wrap.c: In function ‘_wrap_CAST_t_pd’:
  69. tcl_wrap.c:25956:10: warning: assignment from incompatible pointer type [enabled
  70.  by default]
  71. tcl_wrap.c: In function ‘_wrap_CAST_t_text’:
  72. tcl_wrap.c:25977:5: warning: passing argument 3 of ‘SWIG_Tcl_ConvertPtr’ from in
  73. compatible pointer type [enabled by default]
  74. tcl_wrap.c:1091:1: note: expected ‘void **’ but argument is of type ‘struct t_te
  75. xt **’
  76. tcl_wrap.c: In function ‘Tclpd_Init’:
  77. tcl_wrap.c:28268:3: warning: left shift count >= width of type [enabled by defau
  78. lt]
  79.  
  80. Analyzing loop at tcl_wrap.c:516
  81.  
  82. Analyzing loop at tcl_wrap.c:619
  83.  
  84. Analyzing loop at tcl_wrap.c:619
  85.  
  86. Analyzing loop at tcl_wrap.c:619
  87.  
  88. Analyzing loop at tcl_wrap.c:409
  89.  
  90.  
  91.  
  92.  
  93.  
  94. [...]
  95.  
  96. Analyzing loop at tcl_wrap.c:6176
  97.  
  98. Analyzing loop at tcl_wrap.c:7657
  99.  
  100. Analyzing loop at tcl_wrap.c:24360
  101.  
  102. Analyzing loop at tcl_wrap.c:25445
  103.  
  104. Analyzing loop at tcl_wrap.c:23408
  105.  
  106. Analyzing loop at tcl_wrap.c:5719
  107.  
  108. Analyzing loop at tcl_wrap.c:5809
  109.  
  110. Analyzing loop at tcl_wrap.c:5764
  111.  
  112. Analyzing loop at tcl_wrap.c:28169
  113.  
  114. Analyzing loop at tcl_wrap.c:28177
  115.  
  116. Analyzing loop at tcl_wrap.c:28145
  117.  
  118. Analyzing loop at tcl_wrap.c:28221
  119.  
  120. Analyzing loop at tcl_wrap.c:28217
  121.  
  122. Analyzing loop at tcl_wrap.c:28103
  123.  
  124. Analyzing loop at tcl_wrap.c:28106
  125.  
  126. Analyzing loop at tcl_wrap.c:27996
  127.  
  128. Analyzing loop at tcl_wrap.c:28026
  129.  
  130. Analyzing loop at tcl_wrap.c:409
  131.  
  132. Analyzing loop at tcl_wrap.c:546
  133.  
  134. Analyzing loop at tcl_wrap.c:551
  135.  
  136. Analyzing loop at tcl_wrap.c:546
  137.  
  138. Analyzing loop at tcl_wrap.c:551
  139.  
  140. Analyzing loop at tcl_wrap.c:27972
  141.  
  142. Analyzing loop at tcl_wrap.c:635
  143. cc  -fPIC -rdynamic -shared -fPIC -Wl,-rpath,"\$ORIGIN",--enable-new-dtags -o "tclpd.pd_linux" tclpd.o hashtable.o tcl_class.o tcl_loader.o tcl_proxyinlet.o tcl_typemap.o tcl_widgetbehavior.o tcl_wrap.o   -lc -ltcl8.5
  144. /usr/bin/ld: cannot find -ltcl8.5
  145. collect2: error: ld returned 1 exit status
  146. make[3]: *** [tclpd.pd_linux] Error 1
  147. make[3]: Leaving directory `/home/smmilut/builds/pd-extended/src/pd-extended/externals/loaders/tclpd'
  148. make[2]: *** [loaders-tclpd] Error 2
  149. make[2]: Leaving directory `/home/smmilut/builds/pd-extended/src/pd-extended/externals'
  150. make[1]: *** [externals_install] Error 2
  151. make[1]: Leaving directory `/home/smmilut/builds/pd-extended/src/pd-extended/packages'
  152. make: *** [install] Error 2
  153. ==> ERROR: A failure occurred in build().
  154.     Aborting...