This week only. Pastebin PRO Accounts Christmas Special! Don't miss out!Want more features on Pastebin? Sign Up, it's FREE!
Guest

Untitled

By: a guest on Mar 15th, 2013  |  syntax: None  |  size: 48.93 KB  |  views: 28  |  expires: Never
download  |  raw  |  embed  |  report abuse  |  print
Text below is selected. Please press Ctrl+C to copy to your clipboard. (⌘+C on Mac)
  1. patching file gio/gdbusaddress.c
  2. Hunk #1 succeeded at 1363 (offset 9 lines).
  3. Hunk #2 succeeded at 1373 (offset 9 lines).
  4. Hunk #3 succeeded at 1414 (offset 9 lines).
  5. patching file glib/gstdio.c
  6. Hunk #1 succeeded at 192 (offset 1 line).
  7. Hunk #2 succeeded at 207 (offset 1 line).
  8. Hunk #3 succeeded at 360 (offset 5 lines).
  9. Hunk #4 succeeded at 372 (offset 5 lines).
  10. Hunk #5 succeeded at 842 (offset 5 lines).
  11. patching file gio/tests/Makefile.am
  12. patching file gio/gcontenttype-win32.c
  13. patching file gio/gio.symbols
  14. Hunk #1 succeeded at 161 (offset -4 lines).
  15. patching file gio/glocalfileinfo.c
  16. Hunk #1 succeeded at 1525 (offset -10 lines).
  17. libtoolize: putting auxiliary files in `.'.
  18. libtoolize: copying file `./ltmain.sh'
  19. libtoolize: putting macros in AC_CONFIG_MACRO_DIR, `m4macros'.
  20. libtoolize: copying file `m4macros/libtool.m4'
  21. libtoolize: copying file `m4macros/ltoptions.m4'
  22. libtoolize: copying file `m4macros/ltsugar.m4'
  23. libtoolize: copying file `m4macros/ltversion.m4'
  24. libtoolize: copying file `m4macros/lt~obsolete.m4'
  25. gtk-doc.make:32: warning: EXTRA_DIST multiply defined in condition TRUE ...
  26. docs/reference/gio/Makefile.am:140:   'gtk-doc.make' included from here
  27. Makefile.decl:8: ... 'EXTRA_DIST' previously defined here
  28. docs/reference/gio/Makefile.am:1:   'Makefile.decl' included from here
  29. docs/reference/gio/Makefile.am:87: warning: 'INCLUDES' is the old name for 'AM_CPPFLAGS' (or '*_CPPFLAGS')
  30. gtk-doc.make:32: warning: EXTRA_DIST multiply defined in condition TRUE ...
  31. docs/reference/gio/gdbus-object-manager-example/Makefile.am:54:   'gtk-doc.make' included from here
  32. Makefile.decl:8: ... 'EXTRA_DIST' previously defined here
  33. docs/reference/gio/gdbus-object-manager-example/Makefile.am:1:   'Makefile.decl' included from here
  34. docs/reference/gio/gdbus-object-manager-example/Makefile.am:25: warning: 'INCLUDES' is the old name for 'AM_CPPFLAGS' (or '*_CPPFLAGS')
  35. gtk-doc.make:32: warning: EXTRA_DIST multiply defined in condition TRUE ...
  36. docs/reference/glib/Makefile.am:85:   'gtk-doc.make' included from here
  37. Makefile.decl:8: ... 'EXTRA_DIST' previously defined here
  38. docs/reference/glib/Makefile.am:2:   'Makefile.decl' included from here
  39. gtk-doc.make:32: warning: EXTRA_DIST multiply defined in condition TRUE ...
  40. docs/reference/gobject/Makefile.am:63:   'gtk-doc.make' included from here
  41. Makefile.decl:8: ... 'EXTRA_DIST' previously defined here
  42. docs/reference/gobject/Makefile.am:2:   'Makefile.decl' included from here
  43. docs/reference/gobject/Makefile.am:36: warning: 'INCLUDES' is the old name for 'AM_CPPFLAGS' (or '*_CPPFLAGS')
  44. parallel-tests: installing './test-driver'
  45. gio/gdbus-2.0/codegen/Makefile.am:6: warning: EXTRA_DIST multiply defined in condition TRUE ...
  46. Makefile.decl:8: ... 'EXTRA_DIST' previously defined here
  47. gio/gdbus-2.0/codegen/Makefile.am:1:   'Makefile.decl' included from here
  48. gio/tests/Makefile.am:631: warning: shell $(glib_compile_resources: non-POSIX variable name
  49. gio/tests/Makefile.am:631: (probably a GNU make extension)
  50. gio/tests/Makefile.am:634: warning: shell $(glib_compile_resources: non-POSIX variable name
  51. gio/tests/Makefile.am:634: (probably a GNU make extension)
  52. gio/tests/Makefile.am:637: warning: shell $(glib_compile_resources: non-POSIX variable name
  53. gio/tests/Makefile.am:637: (probably a GNU make extension)
  54. gio/tests/Makefile.am:640: warning: shell $(glib_compile_resources: non-POSIX variable name
  55. gio/tests/Makefile.am:640: (probably a GNU make extension)
  56. gio/tests/Makefile.am:9: warning: 'INCLUDES' is the old name for 'AM_CPPFLAGS' (or '*_CPPFLAGS')
  57. gio/tests/gdbus-object-manager-example/Makefile.am:7: warning: 'INCLUDES' is the old name for 'AM_CPPFLAGS' (or '*_CPPFLAGS')
  58. glib/gnulib/Makefile.am:4: warning: 'INCLUDES' is the old name for 'AM_CPPFLAGS' (or '*_CPPFLAGS')
  59. glib/libcharset/Makefile.am:4: warning: 'INCLUDES' is the old name for 'AM_CPPFLAGS' (or '*_CPPFLAGS')
  60. glib/tests/Makefile.am:3: warning: 'INCLUDES' is the old name for 'AM_CPPFLAGS' (or '*_CPPFLAGS')
  61. gobject/tests/Makefile.am:6: warning: 'INCLUDES' is the old name for 'AM_CPPFLAGS' (or '*_CPPFLAGS')
  62. tests/gobject/Makefile.am:3: warning: 'INCLUDES' is the old name for 'AM_CPPFLAGS' (or '*_CPPFLAGS')
  63. tests/refcount/Makefile.am:3: warning: 'INCLUDES' is the old name for 'AM_CPPFLAGS' (or '*_CPPFLAGS')
  64. ~/.yaourt/yaourt-tmp-schala/aur-mingw-w64-glib2/src/glib-2.34.3/build-i686-w64-mingw32-static ~/.yaourt/yaourt-tmp-schala/aur-mingw-w64-glib2/src/glib-2.34.3
  65. checking for a BSD-compatible install... /usr/bin/install -c
  66. checking whether build environment is sane... yes
  67. checking for i686-w64-mingw32-strip... i686-w64-mingw32-strip
  68. checking for a thread-safe mkdir -p... /usr/bin/mkdir -p
  69. checking for gawk... gawk
  70. checking whether make sets $(MAKE)... yes
  71. checking whether make supports nested variables... yes
  72. checking how to create a ustar tar archive... gnutar
  73. checking whether to enable maintainer-specific portions of Makefiles... yes
  74. checking whether make supports nested variables... (cached) yes
  75. checking for i686-w64-mingw32-gcc... i686-w64-mingw32-gcc
  76. checking whether the C compiler works... yes
  77. checking for C compiler default output file name... a.exe
  78. checking for suffix of executables... .exe
  79. checking whether we are cross compiling... yes
  80. checking for suffix of object files... o
  81. checking whether we are using the GNU C compiler... yes
  82. checking whether i686-w64-mingw32-gcc accepts -g... yes
  83. checking for i686-w64-mingw32-gcc option to accept ISO C89... none needed
  84. checking for style of include used by make... GNU
  85. checking dependency style of i686-w64-mingw32-gcc... gcc3
  86. checking how to run the C preprocessor... i686-w64-mingw32-gcc -E
  87. checking build system type... x86_64-unknown-linux-gnu
  88. checking host system type... i686-w64-mingw32
  89. checking for the BeOS... no
  90. checking for Win32... yes
  91. checking for Mac OS X Carbon support... no
  92. checking for Mac OS X Cocoa support... no
  93. checking for i686-w64-mingw32-windres... i686-w64-mingw32-windres
  94. checking for i686-w64-mingw32-nm... i686-w64-mingw32-nm
  95. checking for i686-w64-mingw32-ranlib... i686-w64-mingw32-ranlib
  96. checking for lib.exe... no
  97. checking for grep that handles long lines and -e... /usr/bin/grep
  98. checking for egrep... /usr/bin/grep -E
  99. checking whether we are using the GNU C Library 2.1 or newer... no
  100. checking whether to enable garbage collector friendliness... no
  101. checking whether to disable memory pools... no
  102. checking for i686-w64-mingw32-c++... i686-w64-mingw32-c++
  103. checking whether we are using the GNU C++ compiler... yes
  104. checking whether i686-w64-mingw32-c++ accepts -g... yes
  105. checking dependency style of i686-w64-mingw32-c++... gcc3
  106. checking for i686-w64-mingw32-gcc... (cached) i686-w64-mingw32-gcc
  107. checking whether we are using the GNU C compiler... (cached) yes
  108. checking whether i686-w64-mingw32-gcc accepts -g... (cached) yes
  109. checking for i686-w64-mingw32-gcc option to accept ISO C89... (cached) none needed
  110. checking dependency style of i686-w64-mingw32-gcc... (cached) gcc3
  111. checking whether i686-w64-mingw32-gcc and cc understand -c and -o together... yes
  112. checking for special C compiler options needed for large files... no
  113. checking for _FILE_OFFSET_BITS value needed for large files... 64
  114. checking for i686-w64-mingw32-pkg-config... /usr/bin/i686-w64-mingw32-pkg-config
  115. checking pkg-config is at least version 0.16... yes
  116. checking how to get MSVC-compatible struct packing... -mms-bitfields
  117. checking for gawk... (cached) gawk
  118. checking for perl5... no
  119. checking for perl... perl
  120. checking for indent... no
  121. checking for perl... /usr/bin/perl
  122. checking for a Python interpreter with version >= 2.5... python
  123. checking for python... /usr/bin/python
  124. checking for python version... 3.3
  125. checking for python platform... linux
  126. checking for python script directory... ${prefix}/lib/python3.3/site-packages
  127. checking for python extension module directory... ${exec_prefix}/lib/python3.3/site-packages
  128. checking whether to cache iconv descriptors... yes
  129. checking for ZLIB... yes
  130. checking for ANSI C header files... yes
  131. checking for sys/types.h... yes
  132. checking for sys/stat.h... yes
  133. checking for stdlib.h... yes
  134. checking for string.h... yes
  135. checking for memory.h... yes
  136. checking for strings.h... yes
  137. checking for inttypes.h... yes
  138. checking for stdint.h... yes
  139. checking for unistd.h... yes
  140. checking for LIBFFI... yes
  141. checking locale.h usability... yes
  142. checking locale.h presence... yes
  143. checking for locale.h... yes
  144. checking for LC_MESSAGES... no
  145. checking libintl.h usability... yes
  146. checking libintl.h presence... yes
  147. checking for libintl.h... yes
  148. checking for ngettext in libc... no
  149. checking for bindtextdomain in -lintl... yes
  150. checking for ngettext in -lintl... yes
  151. checking for dgettext in -lintl... yes
  152. checking for bind_textdomain_codeset... yes
  153. checking for msgfmt... /usr/bin/msgfmt
  154. checking for dcgettext... yes
  155. checking if msgfmt accepts -c... yes
  156. checking for gmsgfmt... /usr/bin/msgfmt
  157. checking for xgettext... /usr/bin/xgettext
  158. checking for catalogs to be installed...  af am ar as ast az be be@latin bg bn bn_IN bs ca ca@valencia cs cy da de dz el en_CA en_GB en@shaw eo es et eu fa fi fr ga gl gu he hi hr hu hy id is it ja ka kk kn ko ku lt lv mai mg mk ml mn mr ms nb nds ne nl nn oc or pa pl ps pt pt_BR ro ru rw si sk sl sq sr sr@latin sr@ije sv ta te th tl tr ug tt uk vi wa xh yi zh_CN zh_HK zh_TW
  159. checking how to print strings... printf
  160. checking for a sed that does not truncate output... /usr/bin/sed
  161. checking for fgrep... /usr/bin/grep -F
  162. checking for ld used by i686-w64-mingw32-gcc... /usr/i686-w64-mingw32/bin/ld
  163. checking if the linker (/usr/i686-w64-mingw32/bin/ld) is GNU ld... yes
  164. checking for BSD- or MS-compatible name lister (nm)... i686-w64-mingw32-nm
  165. checking the name lister (i686-w64-mingw32-nm) interface... BSD nm
  166. checking whether ln -s works... yes
  167. checking the maximum length of command line arguments... 1572864
  168. checking whether the shell understands some XSI constructs... yes
  169. checking whether the shell understands "+="... yes
  170. checking how to convert x86_64-unknown-linux-gnu file names to i686-w64-mingw32 format... func_convert_file_nix_to_w32
  171. checking how to convert x86_64-unknown-linux-gnu file names to toolchain format... func_convert_file_noop
  172. checking for /usr/i686-w64-mingw32/bin/ld option to reload object files... -r
  173. checking for i686-w64-mingw32-objdump... i686-w64-mingw32-objdump
  174. checking how to recognize dependent libraries... file_magic ^x86 archive import|^x86 DLL
  175. checking for i686-w64-mingw32-dlltool... i686-w64-mingw32-dlltool
  176. checking how to associate runtime and link libraries... func_cygming_dll_for_implib
  177. checking for i686-w64-mingw32-ar... i686-w64-mingw32-ar
  178. checking for archiver @FILE support... @
  179. checking for i686-w64-mingw32-strip... (cached) i686-w64-mingw32-strip
  180. checking for i686-w64-mingw32-ranlib... (cached) i686-w64-mingw32-ranlib
  181. checking command to parse i686-w64-mingw32-nm output from i686-w64-mingw32-gcc object... ok
  182. checking for sysroot... no
  183. checking for i686-w64-mingw32-mt... no
  184. checking for mt... no
  185. checking if : is a manifest tool... no
  186. checking for dlfcn.h... no
  187. checking for i686-w64-mingw32-as... i686-w64-mingw32-as
  188. checking for i686-w64-mingw32-dlltool... (cached) i686-w64-mingw32-dlltool
  189. checking for i686-w64-mingw32-objdump... (cached) i686-w64-mingw32-objdump
  190. checking for objdir... .libs
  191. checking if i686-w64-mingw32-gcc supports -fno-rtti -fno-exceptions... no
  192. checking for i686-w64-mingw32-gcc option to produce PIC... -DDLL_EXPORT -DPIC
  193. checking if i686-w64-mingw32-gcc PIC flag -DDLL_EXPORT -DPIC works... yes
  194. checking if i686-w64-mingw32-gcc static flag -static works... yes
  195. checking if i686-w64-mingw32-gcc supports -c -o file.o... yes
  196. checking if i686-w64-mingw32-gcc supports -c -o file.o... (cached) yes
  197. checking whether the i686-w64-mingw32-gcc linker (/usr/i686-w64-mingw32/bin/ld) supports shared libraries... yes
  198. checking dynamic linker characteristics... Win32 ld.exe
  199. checking how to hardcode library paths into programs... immediate
  200. checking whether stripping libraries is possible... yes
  201. checking if libtool supports shared libraries... yes
  202. checking whether to build shared libraries... no
  203. checking whether to build static libraries... yes
  204. checking how to run the C++ preprocessor... i686-w64-mingw32-c++ -E
  205. checking for ld used by i686-w64-mingw32-c++... /usr/i686-w64-mingw32/bin/ld
  206. checking if the linker (/usr/i686-w64-mingw32/bin/ld) is GNU ld... yes
  207. checking whether the i686-w64-mingw32-c++ linker (/usr/i686-w64-mingw32/bin/ld) supports shared libraries... yes
  208. checking for i686-w64-mingw32-c++ option to produce PIC... -DDLL_EXPORT -DPIC
  209. checking if i686-w64-mingw32-c++ PIC flag -DDLL_EXPORT -DPIC works... yes
  210. checking if i686-w64-mingw32-c++ static flag -static works... yes
  211. checking if i686-w64-mingw32-c++ supports -c -o file.o... yes
  212. checking if i686-w64-mingw32-c++ supports -c -o file.o... (cached) yes
  213. checking whether the i686-w64-mingw32-c++ linker (/usr/i686-w64-mingw32/bin/ld) supports shared libraries... yes
  214. checking dynamic linker characteristics... Win32 ld.exe
  215. checking how to hardcode library paths into programs... immediate
  216. configure: creating ./config.lt
  217. config.lt: creating libtool
  218. checking for extra flags for POSIX compliance... none needed
  219. checking for vprintf... yes
  220. checking for _doprnt... no
  221. checking for size_t... yes
  222. checking for working alloca.h... no
  223. checking for alloca... yes
  224. checking for mmap... no
  225. checking for posix_memalign... no
  226. checking for memalign... no
  227. checking for valloc... no
  228. checking for fsync... no
  229. checking for pipe2... no
  230. checking for issetugid... no
  231. checking for atexit... yes
  232. checking for on_exit... no
  233. checking for timegm... no
  234. checking for gmtime_r... no
  235. checking for __libc_enable_secure... no
  236. checking size of char... 1
  237. checking size of short... 2
  238. checking size of long... 4
  239. checking size of int... 4
  240. checking size of void *... 4
  241. checking size of long long... 8
  242. checking size of __int64... 8
  243. checking for sig_atomic_t... yes
  244. checking for format to printf and scanf a guint64... %I64u
  245. checking for an ANSI C-conforming const... yes
  246. checking if malloc() and friends prototypes are gmem.h compatible... no
  247. checking for growing stack pointer... (cached) no
  248. checking for __inline... yes
  249. checking for __inline__... yes
  250. checking for inline... yes
  251. checking if inline functions in headers work... yes
  252. checking for working do while(0) macros... yes
  253. checking for ISO C99 varargs macros in C... yes
  254. checking for ISO C99 varargs macros in C++... yes
  255. checking for GNUC varargs macros... yes
  256. checking for GNUC visibility attribute... no
  257. checking whether using Sun Studio C compiler... no
  258. checking whether byte ordering is bigendian... no
  259. checking dirent.h usability... yes
  260. checking dirent.h presence... yes
  261. checking for dirent.h... yes
  262. checking float.h usability... yes
  263. checking float.h presence... yes
  264. checking for float.h... yes
  265. checking limits.h usability... yes
  266. checking limits.h presence... yes
  267. checking for limits.h... yes
  268. checking pwd.h usability... no
  269. checking pwd.h presence... no
  270. checking for pwd.h... no
  271. checking grp.h usability... no
  272. checking grp.h presence... no
  273. checking for grp.h... no
  274. checking sys/param.h usability... yes
  275. checking sys/param.h presence... yes
  276. checking for sys/param.h... yes
  277. checking sys/poll.h usability... no
  278. checking sys/poll.h presence... no
  279. checking for sys/poll.h... no
  280. checking sys/resource.h usability... no
  281. checking sys/resource.h presence... no
  282. checking for sys/resource.h... no
  283. checking sys/time.h usability... yes
  284. checking sys/time.h presence... yes
  285. checking for sys/time.h... yes
  286. checking sys/times.h usability... no
  287. checking sys/times.h presence... no
  288. checking for sys/times.h... no
  289. checking sys/wait.h usability... no
  290. checking sys/wait.h presence... no
  291. checking for sys/wait.h... no
  292. checking for unistd.h... (cached) yes
  293. checking values.h usability... no
  294. checking values.h presence... no
  295. checking for values.h... no
  296. checking sys/select.h usability... no
  297. checking sys/select.h presence... no
  298. checking for sys/select.h... no
  299. checking for sys/types.h... (cached) yes
  300. checking for stdint.h... (cached) yes
  301. checking for inttypes.h... (cached) yes
  302. checking sched.h usability... yes
  303. checking sched.h presence... yes
  304. checking for sched.h... yes
  305. checking malloc.h usability... yes
  306. checking malloc.h presence... yes
  307. checking for malloc.h... yes
  308. checking sys/vfs.h usability... no
  309. checking sys/vfs.h presence... no
  310. checking for sys/vfs.h... no
  311. checking sys/vmount.h usability... no
  312. checking sys/vmount.h presence... no
  313. checking for sys/vmount.h... no
  314. checking sys/statfs.h usability... no
  315. checking sys/statfs.h presence... no
  316. checking for sys/statfs.h... no
  317. checking sys/statvfs.h usability... no
  318. checking sys/statvfs.h presence... no
  319. checking for sys/statvfs.h... no
  320. checking sys/filio.h usability... no
  321. checking sys/filio.h presence... no
  322. checking for sys/filio.h... no
  323. checking mntent.h usability... no
  324. checking mntent.h presence... no
  325. checking for mntent.h... no
  326. checking sys/mnttab.h usability... no
  327. checking sys/mnttab.h presence... no
  328. checking for sys/mnttab.h... no
  329. checking sys/vfstab.h usability... no
  330. checking sys/vfstab.h presence... no
  331. checking for sys/vfstab.h... no
  332. checking sys/mntctl.h usability... no
  333. checking sys/mntctl.h presence... no
  334. checking for sys/mntctl.h... no
  335. checking fstab.h usability... no
  336. checking fstab.h presence... no
  337. checking for fstab.h... no
  338. checking sys/uio.h usability... no
  339. checking sys/uio.h presence... no
  340. checking for sys/uio.h... no
  341. checking sys/mkdev.h usability... no
  342. checking sys/mkdev.h presence... no
  343. checking for sys/mkdev.h... no
  344. checking linux/magic.h usability... no
  345. checking linux/magic.h presence... no
  346. checking for linux/magic.h... no
  347. checking sys/prctl.h usability... no
  348. checking sys/prctl.h presence... no
  349. checking for sys/prctl.h... no
  350. checking for sys/mount.h... no
  351. checking for sys/sysctl.h... no
  352. checking xlocale.h usability... no
  353. checking xlocale.h presence... no
  354. checking for xlocale.h... no
  355. checking for struct stat.st_mtimensec... no
  356. checking for struct stat.st_mtim.tv_nsec... no
  357. checking for struct stat.st_atimensec... no
  358. checking for struct stat.st_atim.tv_nsec... no
  359. checking for struct stat.st_ctimensec... no
  360. checking for struct stat.st_ctim.tv_nsec... no
  361. checking for struct stat.st_blksize... no
  362. checking for struct stat.st_blocks... no
  363. checking for struct statfs.f_fstypename... no
  364. checking for struct statfs.f_bavail... no
  365. checking for struct statvfs.f_basetype... no
  366. checking for struct statvfs.f_fstypename... no
  367. checking for struct tm.tm_gmtoff... no
  368. checking for struct tm.__tm_gmtoff... no
  369. checking for dirent.h that defines DIR... yes
  370. checking for library containing opendir... none required
  371. checking for struct dirent.d_type... no
  372. checking for nl_langinfo and CODESET... no
  373. checking stddef.h usability... yes
  374. checking stddef.h presence... yes
  375. checking for stddef.h... yes
  376. checking for stdlib.h... (cached) yes
  377. checking for string.h... (cached) yes
  378. checking for setlocale... yes
  379. checking size of size_t... 4
  380. checking for the appropriate definition for size_t... unsigned int
  381. checking for lstat... no
  382. checking for strerror... yes
  383. checking for strsignal... no
  384. checking for memmove... yes
  385. checking for vsnprintf... yes
  386. checking for stpcpy... no
  387. checking for strcasecmp... yes
  388. checking for strncasecmp... yes
  389. checking for poll... no
  390. checking for getcwd... yes
  391. checking for vasprintf... no
  392. checking for setenv... no
  393. checking for unsetenv... no
  394. checking for getc_unlocked... no
  395. checking for readlink... no
  396. checking for symlink... no
  397. checking for fdwalk... no
  398. checking for memmem... no
  399. checking for chown... no
  400. checking for lchmod... no
  401. checking for lchown... no
  402. checking for fchmod... no
  403. checking for fchown... no
  404. checking for link... no
  405. checking for utimes... no
  406. checking for getgrgid... no
  407. checking for getpwuid... no
  408. checking for getresuid... no
  409. checking for getmntent_r... no
  410. checking for setmntent... no
  411. checking for endmntent... no
  412. checking for hasmntopt... no
  413. checking for getfsstat... no
  414. checking for getvfsstat... no
  415. checking for splice... no
  416. checking for prlimit... no
  417. checking whether to use statfs or statvfs... neither
  418. checking crt_externs.h usability... no
  419. checking crt_externs.h presence... no
  420. checking for crt_externs.h... no
  421. checking for _NSGetEnviron... no
  422. checking for newlocale... no
  423. checking for uselocale... no
  424. checking for strtod_l... no
  425. checking for strtoll_l... no
  426. checking for strtoull_l... no
  427. checking for C99 vsnprintf... (cached) no
  428. checking whether printf supports positional parameters... no
  429. checking value of AF_INET... 2
  430. checking value of AF_INET6... 23
  431. checking value of AF_UNIX... 1
  432. checking value of MSG_PEEK... 2
  433. checking value of MSG_OOB... 1
  434. checking value of MSG_DONTROUTE... 4
  435. checking for getprotobyname_r... no
  436. checking for endservent... no
  437. checking for if_nametoindex... no
  438. checking netdb.h usability... no
  439. checking netdb.h presence... no
  440. checking for netdb.h... no
  441. checking wspiapi.h usability... yes
  442. checking wspiapi.h presence... yes
  443. checking for wspiapi.h... yes
  444. checking arpa/nameser_compat.h usability... no
  445. checking arpa/nameser_compat.h presence... no
  446. checking for arpa/nameser_compat.h... no
  447. checking for linux/netlink.h... no
  448. checking for struct ip_mreqn... no
  449. checking for signed... yes
  450. checking for long long... yes
  451. checking for long double... yes
  452. checking for wchar_t... yes
  453. checking for wint_t... yes
  454. checking for size_t... (cached) yes
  455. checking for ptrdiff_t... yes
  456. checking for inttypes.h... yes
  457. checking for stdint.h... yes
  458. checking for snprintf... yes
  459. checking for wcslen... yes
  460. checking for C99 snprintf... (cached) no
  461. checking for fd_set... no
  462. checking whether realloc (NULL,) will work... yes
  463. checking for nl_langinfo (CODESET)... yes
  464. checking for nl_langinfo (PM_STR)... yes
  465. checking for nl_langinfo (_NL_CTYPE_OUTDIGITn_MB)... no
  466. checking for a compliant posix_memalign() implementation... no
  467. checking for OpenBSD strlcpy/strlcat... no
  468. checking for an implementation of va_copy()... yes
  469. checking for an implementation of __va_copy()... yes
  470. checking whether va_lists can be copied by value... yes
  471. checking for the suffix of module shared libraries... .dll
  472. checking for gspawn implementation... gspawn-win32.lo
  473. checking for GIOChannel implementation... giowin32.lo
  474. checking for is_selinux_enabled in -lselinux... no
  475. checking sys/inotify.h usability... no
  476. checking sys/inotify.h presence... no
  477. checking for sys/inotify.h... no
  478. checking for FAMOpen in -lfam... no
  479. configure: WARNING: *** FAM support will not be built (FAM library not found) ***
  480. checking for getxattr in -lc... no
  481. checking for getxattr in -lattr... no
  482. checking for LIBELF... no
  483. checking for elf_begin in -lelf... no
  484. checking for elf_getshdrstrndx in -lelf... no
  485. checking for elf_getshdrnum in -lelf... no
  486. checking libelf.h usability... no
  487. checking libelf.h presence... no
  488. checking for libelf.h... no
  489. checking for platform-dependent source... gwin32.lo
  490. checking whether to compile timeloop... no
  491. checking if building for some Win32 platform... yes
  492. checking for thread implementation... win32
  493. configure: WARNING: I can't find the MACRO to enable thread safety on your
  494.                 platform (normally it's _REENTRANT). I'll not use any flag on
  495.                 compilation now, but then your programs might not work.
  496.                 Please provide information on how it is done on your system.
  497. checking thread related cflags...
  498. checking thread related libraries...
  499. checking for localtime_r... no
  500. checking for gmtime_r... (cached) no
  501. configure: WARNING: the 'g_get_(user_name|real_name|home_dir|tmp_dir)'
  502.                 functions will not be MT-safe during their first call because
  503.                 there is no working 'getpwuid_r' on your system.
  504. configure: WARNING: the 'g_date_set_time' function will not be MT-safe
  505.                 because there is no 'localtime_r' on your system.
  506. checking for clock_gettime... no
  507. checking for clock_gettime in -lrt... no
  508. checking for lock-free atomic intrinsics... yes
  509. checking for futex(2) system call... no
  510. checking for eventfd(2) system call... no
  511. checking for broken poll... no (cross compiling)
  512. checking whether compiler understands -Wno-pointer-sign... yes
  513. checking for EILSEQ... yes
  514. checking for glib-genmarshal... /usr/bin/glib-genmarshal
  515. checking for glib-compile-schemas... /usr/bin/glib-compile-schemas
  516. checking for glib-compile-resources... /usr/bin/glib-compile-resources
  517. checking for gtkdoc-check... /usr/bin/gtkdoc-check
  518. checking for gtkdoc-rebase... /usr/bin/gtkdoc-rebase
  519. checking for gtkdoc-mkpdf... /usr/bin/gtkdoc-mkpdf
  520. checking whether to build gtk-doc documentation... no
  521. checking for xsltproc... /usr/bin/xsltproc
  522. checking for XML catalog (/etc/xml/catalog)... found
  523. checking for xmlcatalog... /usr/bin/xmlcatalog
  524. checking for DocBook XML DTD V4.1.2 in XML catalog... found
  525. checking for DocBook XSL Stylesheets in XML catalog... found
  526. checking whether to generate man pages... yes
  527. checking whether to include dtrace tracing support... yes
  528. checking for dtrace... no
  529. checking whether to include systemtap tracing support... no
  530. checking for guint32... yes
  531. checking alignment of guint32... 4
  532. checking for guint64... yes
  533. checking alignment of guint64... 8
  534. checking for unsigned long... yes
  535. checking alignment of unsigned long... 4
  536. checking for DBUS1... no
  537. checking for dbus-daemon... dbus-daemon
  538. checking for -Bsymbolic-functions linker flag... yes
  539. checking that generated files are newer than configure... done
  540. configure: creating ./config.status
  541. config.status: creating glib-2.0.pc
  542. config.status: creating gmodule-2.0.pc
  543. config.status: creating gmodule-export-2.0.pc
  544. config.status: creating gmodule-no-export-2.0.pc
  545. config.status: creating gthread-2.0.pc
  546. config.status: creating gobject-2.0.pc
  547. config.status: creating gio-2.0.pc
  548. config.status: creating gio-unix-2.0.pc
  549. config.status: creating gio-windows-2.0.pc
  550. config.status: creating glib-zip
  551. config.status: creating glib-gettextize
  552. config.status: creating Makefile
  553. config.status: creating build/Makefile
  554. config.status: creating build/win32/Makefile
  555. config.status: creating build/win32/dirent/Makefile
  556. config.status: creating build/win32/vs9/Makefile
  557. config.status: creating build/win32/vs10/Makefile
  558. config.status: creating glib/Makefile
  559. config.status: creating glib/glib.stp
  560. config.status: creating glib/libcharset/Makefile
  561. config.status: creating glib/gnulib/Makefile
  562. config.status: creating glib/pcre/Makefile
  563. config.status: creating glib/update-pcre/Makefile
  564. config.status: creating glib/tests/Makefile
  565. config.status: creating gmodule/Makefile
  566. config.status: creating gmodule/gmoduleconf.h
  567. config.status: creating gobject/Makefile
  568. config.status: creating gobject/gobject.stp
  569. config.status: creating gobject/glib-mkenums
  570. config.status: creating gobject/tests/Makefile
  571. config.status: creating gthread/Makefile
  572. config.status: creating gio/Makefile
  573. config.status: creating gio/gdbus-2.0/codegen/Makefile
  574. config.status: creating gio/gdbus-2.0/codegen/config.py
  575. config.status: creating gio/xdgmime/Makefile
  576. config.status: creating gio/inotify/Makefile
  577. config.status: creating gio/fen/Makefile
  578. config.status: creating gio/fam/Makefile
  579. config.status: creating gio/win32/Makefile
  580. config.status: creating gio/tests/Makefile
  581. config.status: creating gio/tests/gdbus-object-manager-example/Makefile
  582. config.status: creating po/Makefile.in
  583. config.status: creating docs/Makefile
  584. config.status: creating docs/reference/Makefile
  585. config.status: creating docs/reference/glib/Makefile
  586. config.status: creating docs/reference/glib/version.xml
  587. config.status: creating docs/reference/gobject/Makefile
  588. config.status: creating docs/reference/gobject/version.xml
  589. config.status: creating docs/reference/gio/Makefile
  590. config.status: creating docs/reference/gio/gdbus-object-manager-example/Makefile
  591. config.status: creating docs/reference/gio/version.xml
  592. config.status: creating tests/Makefile
  593. config.status: creating tests/gobject/Makefile
  594. config.status: creating tests/refcount/Makefile
  595. config.status: creating m4macros/Makefile
  596. config.status: creating config.h
  597. config.status: executing depfiles commands
  598. config.status: executing default-1 commands
  599. config.status: executing libtool commands
  600. config.status: executing glib/glibconfig.h commands
  601. config.status: executing chmod-scripts commands
  602. make  all-recursive
  603. make[1]: Entering directory `/home/schala/.yaourt/yaourt-tmp-schala/aur-mingw-w64-glib2/src/glib-2.34.3/build-i686-w64-mingw32-static'
  604. Making all in .
  605. make[2]: Entering directory `/home/schala/.yaourt/yaourt-tmp-schala/aur-mingw-w64-glib2/src/glib-2.34.3/build-i686-w64-mingw32-static'
  606. make[2]: Leaving directory `/home/schala/.yaourt/yaourt-tmp-schala/aur-mingw-w64-glib2/src/glib-2.34.3/build-i686-w64-mingw32-static'
  607. Making all in m4macros
  608. make[2]: Entering directory `/home/schala/.yaourt/yaourt-tmp-schala/aur-mingw-w64-glib2/src/glib-2.34.3/build-i686-w64-mingw32-static/m4macros'
  609. make[2]: Nothing to be done for `all'.
  610. make[2]: Leaving directory `/home/schala/.yaourt/yaourt-tmp-schala/aur-mingw-w64-glib2/src/glib-2.34.3/build-i686-w64-mingw32-static/m4macros'
  611. Making all in glib
  612. make[2]: Entering directory `/home/schala/.yaourt/yaourt-tmp-schala/aur-mingw-w64-glib2/src/glib-2.34.3/build-i686-w64-mingw32-static/glib'
  613.   GEN      glibconfig-stamp
  614. config.status: executing glib/glibconfig.h commands
  615. config.status: glib/glibconfig.h is unchanged
  616. make  all-recursive
  617. make[3]: Entering directory `/home/schala/.yaourt/yaourt-tmp-schala/aur-mingw-w64-glib2/src/glib-2.34.3/build-i686-w64-mingw32-static/glib'
  618. Making all in libcharset
  619. make[4]: Entering directory `/home/schala/.yaourt/yaourt-tmp-schala/aur-mingw-w64-glib2/src/glib-2.34.3/build-i686-w64-mingw32-static/glib/libcharset'
  620.   CC       localcharset.lo
  621.   CCLD     libcharset.la
  622.   GEN      ref-add.sed
  623.   GEN      ref-del.sed
  624.   GEN      charset.alias
  625. make[4]: Leaving directory `/home/schala/.yaourt/yaourt-tmp-schala/aur-mingw-w64-glib2/src/glib-2.34.3/build-i686-w64-mingw32-static/glib/libcharset'
  626. Making all in gnulib
  627. make[4]: Entering directory `/home/schala/.yaourt/yaourt-tmp-schala/aur-mingw-w64-glib2/src/glib-2.34.3/build-i686-w64-mingw32-static/glib/gnulib'
  628.   CC       asnprintf.lo
  629.   CC       printf-args.lo
  630.   CC       printf-parse.lo
  631.   CC       vasnprintf.lo
  632. ../../../glib/gnulib/vasnprintf.c: In function '_g_gnulib_vasnprintf':
  633. ../../../glib/gnulib/vasnprintf.c:732:11: warning: variable 'retcount' set but not used [-Wunused-but-set-variable]
  634.   CC       printf.lo
  635.   CCLD     libgnulib.la
  636. make[4]: Leaving directory `/home/schala/.yaourt/yaourt-tmp-schala/aur-mingw-w64-glib2/src/glib-2.34.3/build-i686-w64-mingw32-static/glib/gnulib'
  637. Making all in pcre
  638. make[4]: Entering directory `/home/schala/.yaourt/yaourt-tmp-schala/aur-mingw-w64-glib2/src/glib-2.34.3/build-i686-w64-mingw32-static/glib/pcre'
  639.   CC       libpcre_la-pcre_byte_order.lo
  640.   CC       libpcre_la-pcre_chartables.lo
  641.   CC       libpcre_la-pcre_compile.lo
  642.   CC       libpcre_la-pcre_config.lo
  643.   CC       libpcre_la-pcre_dfa_exec.lo
  644.   CC       libpcre_la-pcre_exec.lo
  645.   CC       libpcre_la-pcre_fullinfo.lo
  646.   CC       libpcre_la-pcre_get.lo
  647.   CC       libpcre_la-pcre_globals.lo
  648.   CC       libpcre_la-pcre_jit_compile.lo
  649.   CC       libpcre_la-pcre_newline.lo
  650.   CC       libpcre_la-pcre_ord2utf8.lo
  651.   CC       libpcre_la-pcre_string_utils.lo
  652.   CC       libpcre_la-pcre_study.lo
  653.   CC       libpcre_la-pcre_tables.lo
  654.   CC       libpcre_la-pcre_valid_utf8.lo
  655.   CC       libpcre_la-pcre_xclass.lo
  656.   CCLD     libpcre.la
  657. make[4]: Leaving directory `/home/schala/.yaourt/yaourt-tmp-schala/aur-mingw-w64-glib2/src/glib-2.34.3/build-i686-w64-mingw32-static/glib/pcre'
  658. Making all in update-pcre
  659. make[4]: Entering directory `/home/schala/.yaourt/yaourt-tmp-schala/aur-mingw-w64-glib2/src/glib-2.34.3/build-i686-w64-mingw32-static/glib/update-pcre'
  660. make[4]: Nothing to be done for `all'.
  661. make[4]: Leaving directory `/home/schala/.yaourt/yaourt-tmp-schala/aur-mingw-w64-glib2/src/glib-2.34.3/build-i686-w64-mingw32-static/glib/update-pcre'
  662. Making all in .
  663. make[4]: Entering directory `/home/schala/.yaourt/yaourt-tmp-schala/aur-mingw-w64-glib2/src/glib-2.34.3/build-i686-w64-mingw32-static/glib'
  664.   CC       gallocator.lo
  665.   CC       gcache.lo
  666.   CC       gcompletion.lo
  667.   CC       grel.lo
  668.   CC       gthread-deprecated.lo
  669.   CC       garray.lo
  670.   CC       gasyncqueue.lo
  671.   CC       gatomic.lo
  672.   CC       gbacktrace.lo
  673.   CC       gbase64.lo
  674.   CC       gbitlock.lo
  675.   CC       gbookmarkfile.lo
  676.   CC       gbytes.lo
  677.   CC       gcharset.lo
  678.   CC       gchecksum.lo
  679.   CC       gconvert.lo
  680. ../../glib/gconvert.c: In function 'g_iconv':
  681. ../../glib/gconvert.c:310:3: warning: passing argument 2 of 'iconv' from incompatible pointer type [enabled by default]
  682. In file included from ../../glib/gconvert.c:35:0:
  683. ../../glib/win_iconv.c:775:1: note: expected 'const char **' but argument is of type 'gchar **'
  684. ../../glib/win_iconv.c: In function 'utf32_mbtowc':
  685. ../../glib/win_iconv.c:1540:52: warning: 'wc' may be used uninitialized in this function [-Wmaybe-uninitialized]
  686.   CC       gdataset.lo
  687.   CC       gdate.lo
  688.   CC       gdatetime.lo
  689.   CC       gdir.lo
  690.   CC       genviron.lo
  691.   CC       gerror.lo
  692.   CC       gfileutils.lo
  693.   CC       ggettext.lo
  694.   CC       ghash.lo
  695.   CC       ghmac.lo
  696.   CC       ghook.lo
  697.   CC       ghostutils.lo
  698.   CC       giochannel.lo
  699.   CC       gkeyfile.lo
  700. ../../glib/gkeyfile.c:45:0: warning: "fstat" redefined [enabled by default]
  701. In file included from ../../glib/gkeyfile.c:38:0:
  702. /usr/lib/gcc/i686-w64-mingw32/4.7.2/../../../../i686-w64-mingw32/include/sys/stat.h:256:0: note: this is the location of the previous definition
  703. ../../glib/gkeyfile.c:46:0: warning: "stat" redefined [enabled by default]
  704. In file included from ../../glib/gkeyfile.c:38:0:
  705. /usr/lib/gcc/i686-w64-mingw32/4.7.2/../../../../i686-w64-mingw32/include/sys/stat.h:255:0: note: this is the location of the previous definition
  706.   CC       glib-init.lo
  707.   CC       glib-private.lo
  708.   CC       glist.lo
  709.   CC       gmain.lo
  710. ../../glib/gmain.c: In function 'g_main_context_iterate.isra.21':
  711. ../../glib/gmain.c:3603:20: warning: 'poll_timer' may be used uninitialized in this function [-Wmaybe-uninitialized]
  712. ../../glib/gmain.c:3561:11: note: 'poll_timer' was declared here
  713.   CC       gmappedfile.lo
  714. ../../glib/gmappedfile.c:41:0: warning: "fstat" redefined [enabled by default]
  715. In file included from ../../glib/gmappedfile.c:26:0:
  716. /usr/lib/gcc/i686-w64-mingw32/4.7.2/../../../../i686-w64-mingw32/include/sys/stat.h:256:0: note: this is the location of the previous definition
  717. ../../glib/gmappedfile.c:42:0: warning: "stat" redefined [enabled by default]
  718. In file included from ../../glib/gmappedfile.c:26:0:
  719. /usr/lib/gcc/i686-w64-mingw32/4.7.2/../../../../i686-w64-mingw32/include/sys/stat.h:255:0: note: this is the location of the previous definition
  720.   CC       gmarkup.lo
  721.   CC       gmem.lo
  722.   CC       gmessages.lo
  723.   CC       gnode.lo
  724.   CC       goption.lo
  725.   CC       gpattern.lo
  726.   CC       gpoll.lo
  727.   CC       gprimes.lo
  728.   CC       gqsort.lo
  729.   CC       gquark.lo
  730.   CC       gqueue.lo
  731.   CC       grand.lo
  732.   CC       gregex.lo
  733.   CC       gscanner.lo
  734.   CC       gsequence.lo
  735.   CC       gshell.lo
  736.   CC       gslice.lo
  737.   CC       gslist.lo
  738.   CC       gstdio.lo
  739. ../../glib/gstdio.c: In function 'g_stat':
  740. ../../glib/gstdio.c:634:3: warning: passing argument 2 of '_wstat' from incompatible pointer type [enabled by default]
  741. In file included from ../../glib/gstdio.c:27:0:
  742. /usr/lib/gcc/i686-w64-mingw32/4.7.2/../../../../i686-w64-mingw32/include/sys/stat.h:126:23: note: expected 'struct _stat *' but argument is of type 'struct GStatBuf *'
  743. ../../glib/gstdio.c: In function 'g_fopen':
  744. ../../glib/gstdio.c:857:11: warning: value computed is not used [-Wunused-value]
  745.   CC       gstrfuncs.lo
  746.   CC       gstring.lo
  747.   CC       gstringchunk.lo
  748.   CC       gtestutils.lo
  749. ../../glib/gtestutils.c: In function 'g_test_log_send':
  750. ../../glib/gtestutils.c:577:13: warning: unknown conversion type character 'L' in format [-Wformat]
  751. ../../glib/gtestutils.c:577:13: warning: too many arguments for format [-Wformat-extra-args]
  752. ../../glib/gtestutils.c: In function 'g_assertion_message_cmpnum':
  753. ../../glib/gtestutils.c:1906:5: warning: unknown conversion type character 'L' in format [-Wformat]
  754. ../../glib/gtestutils.c:1906:5: warning: format '%s' expects argument of type 'char *', but argument 3 has type 'long double' [-Wformat]
  755. ../../glib/gtestutils.c:1906:5: warning: unknown conversion type character 'L' in format [-Wformat]
  756. ../../glib/gtestutils.c:1906:5: warning: too many arguments for format [-Wformat-extra-args]
  757. ../../glib/gtestutils.c:1908:5: warning: unknown conversion type character 'L' in format [-Wformat]
  758. ../../glib/gtestutils.c:1908:5: warning: format '%s' expects argument of type 'char *', but argument 3 has type 'long double' [-Wformat]
  759. ../../glib/gtestutils.c:1908:5: warning: unknown conversion type character 'L' in format [-Wformat]
  760. ../../glib/gtestutils.c:1908:5: warning: too many arguments for format [-Wformat-extra-args]
  761.   CC       gthread.lo
  762.   CC       gthreadpool.lo
  763.   CC       gtimer.lo
  764.   CC       gtimezone.lo
  765.   CC       gtrashstack.lo
  766.   CC       gtree.lo
  767.   CC       guniprop.lo
  768.   CC       gutf8.lo
  769.   CC       gunibreak.lo
  770.   CC       gunicollate.lo
  771.   CC       gunidecomp.lo
  772.   CC       gurifuncs.lo
  773.   CC       gutils.lo
  774. ../../glib/gutils.c: In function 'g_win32_get_system_data_dirs_for_module':
  775. ../../glib/gutils.c:1951:22: warning: 'hmodule' may be used uninitialized in this function [-Wmaybe-uninitialized]
  776.   CC       gvariant.lo
  777.   CC       gvariant-core.lo
  778.   CC       gvariant-parser.lo
  779.   CC       gvariant-serialiser.lo
  780.   CC       gvarianttypeinfo.lo
  781.   CC       gvarianttype.lo
  782.   CC       gversion.lo
  783.   CC       gwakeup.lo
  784.   CC       gprintf.lo
  785.   CC       gthread-win32.lo
  786.   CC       giowin32.lo
  787. ../../glib/giowin32.c: In function 'g_io_channel_new_file_utf8':
  788. ../../glib/giowin32.c:1680:7: warning: case value '9' not in enumerated type [-Wswitch]
  789. ../../glib/giowin32.c:1684:7: warning: case value '10' not in enumerated type [-Wswitch]
  790. ../../glib/giowin32.c:1688:7: warning: case value '12' not in enumerated type [-Wswitch]
  791. ../../glib/giowin32.c:1734:7: warning: case value '9' not in enumerated type [-Wswitch]
  792. ../../glib/giowin32.c:1735:7: warning: case value '10' not in enumerated type [-Wswitch]
  793. ../../glib/giowin32.c:1736:7: warning: case value '12' not in enumerated type [-Wswitch]
  794.   CC       gspawn-win32.lo
  795.   CC       gwin32.lo
  796.   CCLD     libglib-2.0.la
  797.   CC       gspawn-win32-helper.o
  798. In file included from ../../glib/gspawn-win32-helper.c:29:0:
  799. ../../glib/gspawn-win32.c:68:14: warning: 'debug' defined but not used [-Wunused-variable]
  800.   CCLD     gspawn-win32-helper.exe
  801.   CC       gspawn-win32-helper-console.o
  802. In file included from ../../glib/gspawn-win32-helper.c:29:0,
  803.                  from ../../glib/gspawn-win32-helper-console.c:2:
  804. ../../glib/gspawn-win32.c:68:14: warning: 'debug' defined but not used [-Wunused-variable]
  805.   CCLD     gspawn-win32-helper-console.exe
  806. echo glib-unix.h glib-object.h glib.h galloca.h garray.h gasyncqueue.h gatomic.h gbacktrace.h gbase64.h gbitlock.h gbookmarkfile.h gbytes.h gcharset.h gchecksum.h gconvert.h gdataset.h gdate.h gdatetime.h gdir.h genviron.h gerror.h gfileutils.h ggettext.h ghash.h ghmac.h ghook.h ghostutils.h gi18n.h gi18n-lib.h giochannel.h gkeyfile.h glist.h gmacros.h gmain.h gmappedfile.h gmarkup.h gmem.h gmessages.h gnode.h goption.h gpattern.h gpoll.h gprimes.h gqsort.h gquark.h gqueue.h grand.h gregex.h gscanner.h gsequence.h gshell.h gslice.h gslist.h gspawn.h gstdio.h gstrfuncs.h gtestutils.h gstring.h gstringchunk.h gthread.h gthreadpool.h gtimer.h gtimezone.h gtrashstack.h gtree.h gtypes.h gunicode.h gurifuncs.h gutils.h gvarianttype.h gvariant.h gversion.h gversionmacros.h gwin32.h gprintf.h > glib-public-headers.txt.tmp && mv glib-public-headers.txt.tmp glib-public-headers.txt
  807. make[4]: Leaving directory `/home/schala/.yaourt/yaourt-tmp-schala/aur-mingw-w64-glib2/src/glib-2.34.3/build-i686-w64-mingw32-static/glib'
  808. Making all in tests
  809. make[4]: Entering directory `/home/schala/.yaourt/yaourt-tmp-schala/aur-mingw-w64-glib2/src/glib-2.34.3/build-i686-w64-mingw32-static/glib/tests'
  810.   CC       testing.o
  811.   CCLD     testing.exe
  812.   CC       option-context.o
  813.   CCLD     option-context.exe
  814.   CC       option-argv0.o
  815.   CCLD     option-argv0.exe
  816.   CC       keyfile.o
  817.   CCLD     keyfile.exe
  818.   CC       fileutils.o
  819. ../../../glib/tests/fileutils.c: In function 'test_build_filename':
  820. ../../../glib/tests/fileutils.c:258:3: warning: not enough variable arguments to fit a sentinel [-Wformat]
  821.   CCLD     fileutils.exe
  822.   CC       test-printf.o
  823. ../../../glib/tests/test-printf.c: In function 'test_64bit':
  824. ../../../glib/tests/test-printf.c:724:3: warning: unknown conversion type character 'l' in format [-Wformat]
  825. ../../../glib/tests/test-printf.c:724:3: warning: too many arguments for format [-Wformat-extra-args]
  826. ../../../glib/tests/test-printf.c:728:3: warning: unknown conversion type character 'l' in format [-Wformat]
  827. ../../../glib/tests/test-printf.c:728:3: warning: too many arguments for format [-Wformat-extra-args]
  828. ../../../glib/tests/test-printf.c:732:3: warning: unknown conversion type character 'l' in format [-Wformat]
  829. ../../../glib/tests/test-printf.c:732:3: warning: too many arguments for format [-Wformat-extra-args]
  830. ../../../glib/tests/test-printf.c:736:3: warning: unknown conversion type character 'l' in format [-Wformat]
  831. ../../../glib/tests/test-printf.c:736:3: warning: too many arguments for format [-Wformat-extra-args]
  832. ../../../glib/tests/test-printf.c:740:3: warning: unknown conversion type character 'l' in format [-Wformat]
  833. ../../../glib/tests/test-printf.c:740:3: warning: too many arguments for format [-Wformat-extra-args]
  834. ../../../glib/tests/test-printf.c:744:3: warning: unknown conversion type character 'l' in format [-Wformat]
  835. ../../../glib/tests/test-printf.c:744:3: warning: too many arguments for format [-Wformat-extra-args]
  836. ../../../glib/tests/test-printf.c:748:3: warning: unknown conversion type character 'l' in format [-Wformat]
  837. ../../../glib/tests/test-printf.c:748:3: warning: too many arguments for format [-Wformat-extra-args]
  838. ../../../glib/tests/test-printf.c:752:3: warning: unknown conversion type character 'l' in format [-Wformat]
  839. ../../../glib/tests/test-printf.c:752:3: warning: too many arguments for format [-Wformat-extra-args]
  840. ../../../glib/tests/test-printf.c: In function 'test_64bit2':
  841. ../../../glib/tests/test-printf.c:845:7: warning: unknown conversion type character 'l' in format [-Wformat]
  842. ../../../glib/tests/test-printf.c:845:7: warning: too many arguments for format [-Wformat-extra-args]
  843. ../../../glib/tests/test-printf.c:854:7: warning: unknown conversion type character 'l' in format [-Wformat]
  844. ../../../glib/tests/test-printf.c:854:7: warning: too many arguments for format [-Wformat-extra-args]
  845. ../../../glib/tests/test-printf.c:863:7: warning: unknown conversion type character 'l' in format [-Wformat]
  846. ../../../glib/tests/test-printf.c:863:7: warning: too many arguments for format [-Wformat-extra-args]
  847. ../../../glib/tests/test-printf.c:872:7: warning: unknown conversion type character 'l' in format [-Wformat]
  848. ../../../glib/tests/test-printf.c:872:7: warning: too many arguments for format [-Wformat-extra-args]
  849. ../../../glib/tests/test-printf.c:881:7: warning: unknown conversion type character 'l' in format [-Wformat]
  850. ../../../glib/tests/test-printf.c:881:7: warning: too many arguments for format [-Wformat-extra-args]
  851. ../../../glib/tests/test-printf.c:890:7: warning: unknown conversion type character 'l' in format [-Wformat]
  852. ../../../glib/tests/test-printf.c:890:7: warning: too many arguments for format [-Wformat-extra-args]
  853. ../../../glib/tests/test-printf.c:899:7: warning: unknown conversion type character 'l' in format [-Wformat]
  854. ../../../glib/tests/test-printf.c:899:7: warning: too many arguments for format [-Wformat-extra-args]
  855. ../../../glib/tests/test-printf.c:908:7: warning: unknown conversion type character 'l' in format [-Wformat]
  856. ../../../glib/tests/test-printf.c:908:7: warning: too many arguments for format [-Wformat-extra-args]
  857.   CCLD     test-printf.exe
  858.   CC       protocol.o
  859.   CCLD     protocol.exe
  860.   CC       rand.o
  861.   CCLD     rand.exe
  862.   CC       strfuncs.o
  863.   CCLD     strfuncs.exe
  864.   CC       string.o
  865.   CCLD     string.exe
  866.   CC       markup-parse.o
  867.   CCLD     markup-parse.exe
  868.   CC       markup-collect.o
  869.   CCLD     markup-collect.exe
  870.   CC       markup-escape.o
  871.   CCLD     markup-escape.exe
  872.   CC       markup-subparser.o
  873.   CCLD     markup-subparser.exe
  874.   CC       array-test.o
  875.   CCLD     array-test.exe
  876.   CC       bytes.o
  877.   CCLD     bytes.exe
  878.   CC       hostutils.o
  879.   CCLD     hostutils.exe
  880.   CC       gvariant.o
  881.   CCLD     gvariant.exe
  882.   CC       mem-overflow.o
  883.   CCLD     mem-overflow.exe
  884.   CC       utf8-performance.o
  885.   CCLD     utf8-performance.exe
  886.   CC       utils.o
  887.   CCLD     utils.exe
  888.   CC       regex.o
  889.   CCLD     regex.exe
  890.   CC       base64.o
  891.   CCLD     base64.exe
  892.   CC       sequence.o
  893.   CCLD     sequence.exe
  894.   CC       scannerapi.o
  895.   CCLD     scannerapi.exe
  896.   CC       shell.o
  897.   CCLD     shell.exe
  898.   CC       collate.o
  899.   CCLD     collate.exe
  900.   CC       utf8-pointer.o
  901.   CCLD     utf8-pointer.exe
  902.   CC       utf8-validate.o
  903.   CCLD     utf8-validate.exe
  904.   CC       utf8-misc.o
  905.   CCLD     utf8-misc.exe
  906.   CC       unicode.o
  907.   CCLD     unicode.exe
  908.   CC       checksum.o
  909.   CCLD     checksum.exe
  910.   CC       hmac.o
  911.   CCLD     hmac.exe
  912.   CC       hash.o
  913.   CCLD     hash.exe
  914.   CC       cache.o
  915.   CCLD     cache.exe
  916.   CC       date.o
  917.   CCLD     date.exe
  918.   CC       node.o
  919.   CCLD     node.exe
  920.   CC       convert.o
  921.   CCLD     convert.exe
  922.   CC       list.o
  923.   CCLD     list.exe
  924.   CC       slist.o
  925.   CCLD     slist.exe
  926.   CC       queue.o
  927.   CCLD     queue.exe
  928.   CC       tree.o
  929.   CCLD     tree.exe
  930.   CC       uri.o
  931.   CCLD     uri.exe
  932.   CC       dir.o
  933.   CCLD     dir.exe
  934.   CC       pattern.o
  935.   CCLD     pattern.exe
  936.   CC       logging.o
  937.   CCLD     logging.exe
  938.   CC       error.o
  939.   CCLD     error.exe
  940.   CC       bookmarkfile.o
  941.   CCLD     bookmarkfile.exe
  942.   CC       gdatetime.o
  943. ../../../glib/tests/gdatetime.c: In function 'test_GDateTime_get_utc_offset':
  944. ../../../glib/tests/gdatetime.c:682:13: warning: variable 'ts' set but not used [-Wunused-but-set-variable]
  945. ../../../glib/tests/gdatetime.c: In function 'test_strftime':
  946. ../../../glib/tests/gdatetime.c:1235:7: warning: unknown conversion type character 'C' in format [-Wformat]
  947. ../../../glib/tests/gdatetime.c:1235:7: warning: unknown conversion type character 'e' in format [-Wformat]
  948. ../../../glib/tests/gdatetime.c:1235:7: warning: unknown conversion type character 'F' in format [-Wformat]
  949. ../../../glib/tests/gdatetime.c:1235:7: warning: unknown conversion type character 'g' in format [-Wformat]
  950. ../../../glib/tests/gdatetime.c:1235:7: warning: unknown conversion type character 'G' in format [-Wformat]
  951. ../../../glib/tests/gdatetime.c:1235:7: warning: unknown conversion type character 'h' in format [-Wformat]
  952. ../../../glib/tests/gdatetime.c:1235:7: warning: unknown conversion type character 'n' in format [-Wformat]
  953. ../../../glib/tests/gdatetime.c:1235:7: warning: unknown conversion type character 'r' in format [-Wformat]
  954. ../../../glib/tests/gdatetime.c:1235:7: warning: unknown conversion type character 'R' in format [-Wformat]
  955. ../../../glib/tests/gdatetime.c:1235:7: warning: unknown conversion type character 't' in format [-Wformat]
  956. ../../../glib/tests/gdatetime.c:1235:7: warning: unknown conversion type character 'T' in format [-Wformat]
  957. ../../../glib/tests/gdatetime.c:1235:7: warning: unknown conversion type character 'u' in format [-Wformat]
  958. ../../../glib/tests/gdatetime.c:1235:7: warning: unknown conversion type character 'V' in format [-Wformat]
  959.   CCLD     gdatetime.exe
  960. ../../glib/.libs/libglib-2.0.a(gdatetime.o):gdatetime.c:(.text+0x2237): undefined reference to `nl_langinfo'
  961. ../../glib/.libs/libglib-2.0.a(gdatetime.o):gdatetime.c:(.text+0x2310): undefined reference to `nl_langinfo'
  962. ../../glib/.libs/libglib-2.0.a(gdatetime.o):gdatetime.c:(.text+0x241d): undefined reference to `nl_langinfo'
  963. ../../glib/.libs/libglib-2.0.a(gdatetime.o):gdatetime.c:(.text+0x26ca): undefined reference to `nl_langinfo'
  964. ../../glib/.libs/libglib-2.0.a(gdatetime.o):gdatetime.c:(.text+0x27ad): undefined reference to `nl_langinfo'
  965. ../../glib/.libs/libglib-2.0.a(gdatetime.o):gdatetime.c:(.text+0x29ce): more undefined references to `nl_langinfo' follow
  966. /usr/lib/gcc/i686-w64-mingw32/4.7.2/../../../../i686-w64-mingw32/bin/ld: ../../glib/.libs/libglib-2.0.a(gdatetime.o): bad reloc address 0x124 in section `.rdata'
  967. /usr/lib/gcc/i686-w64-mingw32/4.7.2/../../../../i686-w64-mingw32/bin/ld: final link failed: Invalid operation
  968. collect2: error: ld returned 1 exit status
  969. make[4]: *** [gdatetime.exe] Error 1
  970. make[4]: Leaving directory `/home/schala/.yaourt/yaourt-tmp-schala/aur-mingw-w64-glib2/src/glib-2.34.3/build-i686-w64-mingw32-static/glib/tests'
  971. make[3]: *** [all-recursive] Error 1
  972. make[3]: Leaving directory `/home/schala/.yaourt/yaourt-tmp-schala/aur-mingw-w64-glib2/src/glib-2.34.3/build-i686-w64-mingw32-static/glib'
  973. make[2]: *** [all] Error 2
  974. make[2]: Leaving directory `/home/schala/.yaourt/yaourt-tmp-schala/aur-mingw-w64-glib2/src/glib-2.34.3/build-i686-w64-mingw32-static/glib'
  975. make[1]: *** [all-recursive] Error 1
  976. make[1]: Leaving directory `/home/schala/.yaourt/yaourt-tmp-schala/aur-mingw-w64-glib2/src/glib-2.34.3/build-i686-w64-mingw32-static'
  977. make: *** [all] Error 2
clone this paste RAW Paste Data