SHARE
TWEET

Untitled

a guest Jan 20th, 2013 88 Never
  1. [ 94%] Building CXX object src/test/CMakeFiles/account.dir/account_test.cpp.o
  2. /tmp/packerbuild-0/sflphone-kde/sflphone-kde/src/sflphone-1.2.2/kde/src/test/account_test.cpp:19:32: fatal error: QtTest/QtTest/QtTest: No such file or directory
  3. compilation terminated.
  4. make[2]: *** [src/test/CMakeFiles/account.dir/account_test.cpp.o] Error 1
  5. make[1]: *** [src/test/CMakeFiles/account.dir/all] Error 2
  6. make: *** [all] Error 2
  7. ==> ERROR: A failure occurred in build().
  8.     Aborting...
  9. The build failed.
RAW Paste Data
Top