SHARE
TWEET

Untitled

a guest Jun 2nd, 2010 430 Never
  1. Chapter 11.
  2.  
  3. Underfull \hbox (badness 10000) in paragraph at lines 3--10
  4.  
  5.  
  6. LaTeX Warning: Reference `ref:Chip8emulator' on page 67 undefined on input line
  7.  20.
  8.  
  9.  
  10. LaTeX Warning: Reference `ref:Chip8emulator' on page 67 undefined on input line
  11.  20.
  12.  
  13. (./plugins/blackjack.tex
  14. <plugins/images/ss-blackjack-128x96x2.png, id=694, 96.36pt x 72.27pt>
  15. <use plugins/images/ss-blackjack-128x96x2.png> [67 <./plugins/images/ss-blackja
  16. ck-128x96x2.png (PNG copy)>]) (./plugins/brickmania.tex
  17. <plugins/images/ss-brickmania-128x96x2.png, id=706, 96.36pt x 72.27pt>
  18. <use plugins/images/ss-brickmania-128x96x2.png>
  19. Underfull \hbox (badness 10000) in paragraph at lines 5--9
  20. [68 <./plugins/images/ss-brickmania-128x96x2.png (PNG copy)>])
  21. (./plugins/bubbles.tex
  22. <plugins/images/ss-bubbles-128x96x2.png, id=715, 96.36pt x 72.27pt>
  23. <use plugins/images/ss-bubbles-128x96x2.png>
  24. ! Undefined control sequence.
  25. \PluginRCUp ->\ButtonRCFF
  26.  
  27. l.30     \end{btnmap}
  28.  
  29. ?
  30. ! Emergency stop.
  31. \PluginRCUp ->\ButtonRCFF
  32.  
  33. l.30     \end{btnmap}
  34.  
  35. !  ==> Fatal error occurred, no output PDF file produced!
  36. Transcript written on rockbox-build.log.
  37. make[2]: *** [rockbox-build.aux] Error 1
  38. make[2]: Leaving directory `/home/apache_chroot/sites/rockbox.org/dailybuild-ma\
  39. nuals/build-iaudiom3/manual'
  40. make[1]: *** [manual-pdf] Error 2
  41. make[1]: Leaving directory `/home/apache_chroot/sites/rockbox.org/trunk/manual'
  42. make: *** [manual] Error 2
RAW Paste Data
Top