Want more features on Pastebin? Sign Up, it's FREE!
Guest

Untitled

By: a guest on Apr 17th, 2012  |  syntax: Bash  |  size: 20.87 KB  |  views: 69  |  expires: Never
download  |  raw  |  embed  |  report abuse  |  print
Text below is selected. Please press Ctrl+C to copy to your clipboard. (⌘+C on Mac)
  1. -- =====================
  2. -- Check dependencies...
  3. -- =====================
  4.  
  5. -- > Indicator-Applet:
  6. -- checking for module 'dbusmenu-glib-0.4'
  7. --   package 'dbusmenu-glib-0.4' not found
  8. -- checking for module 'dbusmenu-glib'
  9. --   package 'dbusmenu-glib' not found
  10. -- checking for module 'dbusmenu-gtk3-0.4'
  11. --   package 'dbusmenu-gtk3-0.4' not found
  12. -- checking for module 'dbusmenu-gtk3'
  13. --   package 'dbusmenu-gtk3' not found
  14. -- checking for module 'indicator3-0.4'
  15. --   package 'indicator3-0.4' not found
  16. -- checking for module 'indicator3'
  17. --   package 'indicator3' not found
  18. -- checking for module 'libido3-0.1'
  19. --   package 'libido3-0.1' not found
  20. CMake Warning at CMakeLists.txt:246 (message):
  21.   These modules are required to compile Indicators applet (MeMenu,
  22.   Messaging-Menu, Sound-Control, Status-Notifier and Global-Menu):
  23.   indicator3(-0.4), libido3-0.1, dbusmenu-glib(-0.4), dbusmenu-gtk3(-0.4)
  24.  
  25.  
  26. -- > Indicator Names:
  27. CMake Warning (dev) at CMakeLists.txt:263 (elseif):
  28.   given arguments:
  29.  
  30.     "" "STREQUAL" "1" "AND" "NOT" "(" "GREATER" "0" "OR" "GREATER" "3" "OR" "(" "EQUAL" "3" "AND" "GREATER" "20" ")" ")"
  31.  
  32.   Unknown arguments specified
  33. This warning is for project developers.  Use -Wno-dev to suppress it.
  34.  
  35. -- > Distribution:
  36. -- > AlsaMixer:
  37. -- > Animated Icons:
  38. -- > Cairo Penguin:
  39. -- > Clipper:
  40. -- > Clock:
  41. -- > Composite Manager:
  42. -- > DBus:
  43. --  * Python:
  44. --    Python Version: 2.7.2 (default, Jan 31 2012, 13:19:49) [GCC 4.6.2 20120120 (prerelease)]
  45. --    Python executable program: /usr/bin/python2
  46. --  * Ruby:
  47. -e:1: Use RbConfig instead of obsolete and deprecated Config.
  48. --    Ruby library dir: /usr/lib/ruby/1.9.1
  49. --    will be installed in: /usr//usr/lib/ruby/1.9.1
  50. --  * Mono:
  51. -- Could not find Mono compiler gmcs, won't build Mono interface.
  52. --  * Vala:
  53. --    Path to valac: VALAC_EXE-NOTFOUND
  54. -- Could not find ValaC, won't build Vala interface with the version of your distribution.
  55. CMake Warning at CMakeLists.txt:499 (message):
  56.   This program is required to compile DBus applet with Vala interface: valac
  57.   (version > 0.10)
  58.  
  59.  
  60. running cd "/tmp/packerbuild-0/cairo-dock-plug-ins/cairo-dock-plug-ins/src/cairo-dock-plugins-3.0.0/build/Dbus/interfaces/python" && /usr/bin/python2 setup.py -q build  2>&1
  61. running cd "/tmp/packerbuild-0/cairo-dock-plug-ins/cairo-dock-plug-ins/src/cairo-dock-plugins-3.0.0/build/Dbus/interfaces/bash" && /usr/bin/python2 setup.py -q build  2>&1
  62. -- > Desklet Rendering:
  63. -- > Dialog Rendering:
  64. -- > Disks:
  65. -- > DND2Share:
  66. -- > Dock Rendering:
  67. -- > Doncky:
  68. -- > Drop Indicator:
  69. -- > Dustbin:
  70. -- > Folders:
  71. -- > GMenu:
  72. -- checking for module 'libgnome-menu'
  73. --   package 'libgnome-menu' not found
  74. -- Could not find libgnome-menu; Cairo-Dock won't be built with GMenu applet.
  75. CMake Warning at CMakeLists.txt:614 (message):
  76.  This module is required to compile GMenu applet: libgnome-menu
  77.  
  78.  
  79. -- > GVFS-Integration:
  80. -- > Gnome-Integration:
  81. -- > Gnome-Integration:
  82. CMake Warning at CMakeLists.txt:654 (message):
  83.  This applet is deprecated
  84.  
  85.  
  86. -- > Icon Effects:
  87. -- > Impulse:
  88. --    With FFTW3 support
  89. -- > Illusion:
  90. -- > KDE-Integration:
  91. --   KDE_INTEGRATION_FOUND: 1
  92. -- > Keyboard-Indicator:
  93. -- > LogOut:
  94. -- > Mail:
  95. -- warning : Could not find libetpan; Cairo-Dock won't be built with Mail applet.
  96. CMake Warning at CMakeLists.txt:858 (message):
  97.   This module is required to compile Mail applet: libetpan
  98.  
  99.  
  100. -- > Motion Blur:
  101. -- > MusicPlayer:
  102. -- > NetSpeed:
  103. -- > Network Monitor:
  104. -- > PowerManager:
  105. -- > Quick Browser:
  106. -- > Recent-Events:
  107. -- checking for module 'zeitgeist-1.0'
  108. --   package 'zeitgeist-1.0' not found
  109. -- Could not find libzeitgeist; Cairo-Dock won't be built with Zeitgeist support.
  110. CMake Warning at CMakeLists.txt:979 (message):
  111.  This module is required to compile Recent-Events applet: zeitgeist-1.0
  112.  
  113.  
  114. -- > Remote Control:
  115. -- > RSSreader:
  116. -- > Scooby-Do:
  117. -- > Shortcuts:
  118. -- > ShowDesktop:
  119. -- > Show Mouse:
  120. -- > Slider:
  121. -- > Stack:
  122. -- > Status Notifier:
  123. -- Could not find Status-Notifier libs; Cairo-Dock won't be built with Status-Notifier support.
  124. CMake Warning at CMakeLists.txt:1091 (message):
  125.   This module is required to compile Status Notifier applet:
  126.   dbusmenu-gtk3(-0.4)
  127.  
  128.  
  129. -- > Switcher:
  130. -- > System Monitor:
  131. -- Could NOT find Sensors (missing:  SENSORS_INCLUDE_DIR SENSORS_LIBRARIES)
  132. -- Could not find libsensors; System-Monitor won't be able to monitor fan speed and CPU temperature.
  133. CMake Warning at CMakeLists.txt:1125 (message):
  134.  This package is required to compile System Monitor applet with Sensors
  135.  support: sensors
  136.  
  137.  
  138. -- > Systray:
  139. -- > Terminal:
  140. -- > Tomboy:
  141. -- > Toons:
  142. -- > Weather:
  143. -- > Weblets:
  144. -- > WiFi:
  145. -- > XFCE-Integration:
  146. --   GVFS found: source file applet-thunar-vfs.c NOT included for compilation.
  147. -- > XGamma:
  148.  
  149. -- ===============
  150. -- Language build:
  151. -- ===============
  152.  
  153. --   Building hu.gmo...
  154. --   Building sk.gmo...
  155. --   Building sr.gmo...
  156. --   Building ja.gmo...
  157. --   Building eu.gmo...
  158. --   Building it.gmo...
  159. --   Building ru.gmo...
  160. --   Building cs.gmo...
  161. --   Building de.gmo...
  162. --   Building uk.gmo...
  163. --   Building ar.gmo...
  164. --   Building sv.gmo...
  165. --   Building es.gmo...
  166. --   Building fr.gmo...
  167. --   Building el.gmo...
  168. --   Building id.gmo...
  169. --   Building tr.gmo...
  170. --   Building en.gmo...
  171. --   Building zh_CN.gmo...
  172. --   Building pt.gmo...
  173. --   Building nl.gmo...
  174. --   Building pl.gmo...
  175. --   Building zh_TW.gmo...
  176. --   Building et.gmo...
  177. --   Building pt_BR.gmo...
  178.  
  179. -- ===============
  180. -- Plug-ins build:
  181. -- ===============
  182.  
  183. -- Stable:
  184. --  Integration plug-ins:
  185. --  - with Gnome support:             yes
  186. --  - with KDE support:               yes
  187. --  - with XFCE support:              yes
  188. --  Plug-ins:
  189. --  - with Alsa-Mixer applet:         yes
  190. --  - with GMenu applet:              no
  191. --  - with Impulse applet:            yes
  192. --  - with Keyboard-indicator applet: yes
  193. --  - with Mail applet:               no
  194. --  - with Me-Menu applet applet:     no
  195. --  - with Messaging-Menu applet:     no
  196. --  - with Recent-Events applet:      no
  197. --  - with Status-Notifier applet:    no
  198. --  - with Terminal applet:           yes
  199. --  - with Weblets applet:            yes
  200. --  - with Xgamma applet:             yes
  201. -- Add On:
  202. --  - with Sound-Menu support:        
  203. --  - with Screen Resolution support: yes
  204. --  - with Sensors support:           no
  205. --  - with UPower support:            yes
  206. --  - with iCal support:              yes
  207. -- Third Party Interfaces:
  208. --  - with Python interface:          yes
  209. --  - with Ruby interface:            yes
  210. --  - with Mono interface:            no
  211. --  - with Vala interface:            yes
  212. --  - with Vala Translator (valac):   no
  213. -- Unstable:
  214. --  - with Global-Menu applet:        no
  215. --  - with Disks applet:              yes
  216. --  - with Doncky applet:             yes
  217. --  - with KDE experimental support:  no
  218. --  - with Network-Monitor applet:    yes
  219. --  - with Scooby-Do applet:          yes
  220. -- Deprecated:
  221. --  - with old Gnome support:         yes
  222.  
  223. -- WARNING: It seems that one (or more) module(s) is (are) missing: indicator3(-0.4) (libido3-0.1) dbusmenu-glib(-0.4) dbusmenu-gtk3(-0.4) libgnome-menu zeitgeist-1.0
  224. -- It can be interesting to install them (especially if you're a maintainer of Cairo-Dock's packages).
  225.  
  226. -- WARNING: It seems that one (or more) program(s) or package(s) is (are) missing: valac libetpan-config sensors
  227. -- It can be interesting to install them (especially if you're a maintainer of Cairo-Dock's packages).
  228.  
  229. -- Configuring done
  230. -- Generating done
  231. -- Build files have been written to: /tmp/packerbuild-0/cairo-dock-plug-ins/cairo-dock-plug-ins/src/cairo-dock-plugins-3.0.0/build
  232. [  1%] Built target cd-Cairo-Penguin
  233. [  3%] Built target cd-AlsaMixer
  234. [  5%] Built target cd-Clipper
  235. [  9%] Built target cd-Animated-icons
  236. [ 13%] Built target cd-clock
  237. [ 13%] Built target python_pyc
  238. [ 13%] Built target bash_pyc
  239. [ 14%] Built target cd-Composite-Manager
  240. [ 14%] Built target CDApplet
  241. [ 16%] Built target cd-Dbus
  242. [ 17%] Built target cd-disks
  243. [ 19%] Built target cd-desklet-rendering
  244. [ 22%] Built target cd-dialog-rendering
  245. [ 25%] Built target cd-rendering
  246. [ 28%] Built target cd-doncky
  247. [ 33%] Built target cd-dnd2share
  248. [ 34%] Built target cd-drop_indicator
  249. [ 35%] Built target cd-Folders
  250. [ 36%] Built target cd-dustbin
  251. [ 36%] Built target gvfs-integration
  252. Scanning dependencies of target cd-Impulse
  253. [ 36%] Building C object gnome-integration-old/src/CMakeFiles/cd_gnome-integration-old.dir/applet-gnome-vfs.c.o
  254. [ 39%] Built target cd-icon-effect
  255. [ 39%] [ 40%] Building C object gnome-integration-old/src/CMakeFiles/cd_gnome-integration-old.dir/applet-utils.c.o
  256. Building C object Impulse/src/CMakeFiles/cd-Impulse.dir/applet-init.c.o
  257. In file included from /usr/include/libgnomeui-2.0/libgnomeui/gnome-app-helper.h:43:0,
  258.                 from /usr/include/libgnomeui-2.0/libgnomeui/libgnomeui.h:35,
  259.                 from /tmp/packerbuild-0/cairo-dock-plug-ins/cairo-dock-plug-ins/src/cairo-dock-plugins-3.0.0/gnome-integration-old/src/applet-gnome-vfs.c:24:
  260. /usr/include/libgnomeui-2.0/libgnomeui/gnome-appbar.h:55:3: error: unknown type name ‘GtkHBox’
  261. /usr/include/libgnomeui-2.0/libgnomeui/gnome-appbar.h:63:3: error: unknown type name ‘GtkHBoxClass’
  262. In file included from /usr/include/libgnomeui-2.0/libgnomeui/libgnomeui.h:35:0,
  263.                 from /tmp/packerbuild-0/cairo-dock-plug-ins/cairo-dock-plug-ins/src/cairo-dock-plugins-3.0.0/gnome-integration-old/src/applet-gnome-vfs.c:24:
  264. /usr/include/libgnomeui-2.0/libgnomeui/gnome-app-helper.h:620:2: error: unknown type name ‘GtkCallbackMarshal’
  265. /usr/include/libgnomeui-2.0/libgnomeui/gnome-app-helper.h:687:9: error: unknown type name ‘GtkCallbackMarshal’
  266. /usr/include/libgnomeui-2.0/libgnomeui/gnome-app-helper.h:725:11: error: unknown type name ‘GtkCallbackMarshal’
  267. /usr/include/libgnomeui-2.0/libgnomeui/gnome-app-helper.h:771:9: error: unknown type name ‘GtkCallbackMarshal’
  268. In file included from /usr/include/libgnomeui-2.0/libgnomeui/libgnomeui.h:39:0,
  269.                 from /tmp/packerbuild-0/cairo-dock-plug-ins/cairo-dock-plug-ins/src/cairo-dock-plugins-3.0.0/gnome-integration-old/src/applet-gnome-vfs.c:24:
  270. /usr/include/libgnomecanvas-2.0/libgnomecanvas/gnome-canvas.h:147:2: error: unknown type name ‘GtkObject’
  271. /usr/include/libgnomecanvas-2.0/libgnomecanvas/gnome-canvas.h:167:2: error: unknown type name ‘GtkObjectClass’
  272. /usr/include/libgnomecanvas-2.0/libgnomecanvas/gnome-canvas.h:196:40: error: unknown type name ‘GdkDrawable’
  273. /usr/include/libgnomecanvas-2.0/libgnomecanvas/gnome-canvas.h:424:2: error: unknown type name ‘GdkGC’
  274. /usr/include/libgnomecanvas-2.0/libgnomecanvas/gnome-canvas.h:487:2: error: unknown type name ‘GdkRgbDither’
  275. /usr/include/libgnomecanvas-2.0/libgnomecanvas/gnome-canvas.h:496:49: error: unknown type name ‘GdkDrawable’
  276. /usr/include/libgnomecanvas-2.0/libgnomecanvas/gnome-canvas.h:621:60: error: unknown type name ‘GdkGC’
  277. /usr/include/libgnomecanvas-2.0/libgnomecanvas/gnome-canvas.h:626:52: error: unknown type name ‘GdkRgbDither’
  278. /usr/include/libgnomecanvas-2.0/libgnomecanvas/gnome-canvas.h:631:1: error: unknown type name ‘GdkRgbDither’
  279. In file included from /usr/include/libgnomeui-2.0/libgnomeui/libgnomeui.h:41:0,
  280.                 from /tmp/packerbuild-0/cairo-dock-plug-ins/cairo-dock-plug-ins/src/cairo-dock-plugins-3.0.0/gnome-integration-old/src/applet-gnome-vfs.c:24:
  281. /usr/include/libgnomecanvas-2.0/libgnomecanvas/gnome-canvas-line.h:110:2: error: unknown type name ‘GdkGC’
  282. /usr/include/libgnomecanvas-2.0/libgnomecanvas/gnome-canvas-line.h:112:2: error: unknown type name ‘GdkBitmap’
  283. /usr/include/libgnomecanvas-2.0/libgnomecanvas/gnome-canvas-line.h:124:2: error: unknown type name ‘GdkCapStyle’
  284. /usr/include/libgnomecanvas-2.0/libgnomecanvas/gnome-canvas-line.h:125:2: error: unknown type name ‘GdkJoinStyle’
  285. /usr/include/libgnomecanvas-2.0/libgnomecanvas/gnome-canvas-line.h:126:2: error: unknown type name ‘GdkLineStyle’
  286. In file included from /usr/include/libgnomeui-2.0/libgnomeui/libgnomeui.h:44:0,
  287.                 from /tmp/packerbuild-0/cairo-dock-plug-ins/cairo-dock-plug-ins/src/cairo-dock-plugins-3.0.0/gnome-integration-old/src/applet-gnome-vfs.c:24:
  288. /usr/include/libgnomecanvas-2.0/libgnomecanvas/gnome-canvas-text.h:122:2: error: unknown type name ‘GdkBitmap’
  289. /usr/include/libgnomecanvas-2.0/libgnomecanvas/gnome-canvas-text.h:123:2: error: unknown type name ‘GdkGC’
  290. /usr/include/libgnomecanvas-2.0/libgnomecanvas/gnome-canvas-text.h:137:2: error: unknown type name ‘GtkAnchorType’
  291. In file included from /usr/include/libgnomeui-2.0/libgnomeui/libgnomeui.h:45:0,
  292.                 from /tmp/packerbuild-0/cairo-dock-plug-ins/cairo-dock-plug-ins/src/cairo-dock-plugins-3.0.0/gnome-integration-old/src/applet-gnome-vfs.c:24:
  293. /usr/include/libgnomecanvas-2.0/libgnomecanvas/gnome-canvas-util.h:148:53: error: unknown type name ‘GdkJoinStyle’
  294. /usr/include/libgnomecanvas-2.0/libgnomecanvas/gnome-canvas-util.h:151:51: error: unknown type name ‘GdkCapStyle’
  295. In file included from /usr/include/libgnomeui-2.0/libgnomeui/libgnomeui.h:46:0,
  296.                 from /tmp/packerbuild-0/cairo-dock-plug-ins/cairo-dock-plug-ins/src/cairo-dock-plugins-3.0.0/gnome-integration-old/src/applet-gnome-vfs.c:24:
  297. /usr/include/libgnomecanvas-2.0/libgnomecanvas/gnome-canvas-widget.h:81:2: error: unknown type name ‘GtkAnchorType’
  298. In file included from /usr/include/libgnomeui-2.0/libgnomeui/libgnomeui.h:48:0,
  299.                 from /tmp/packerbuild-0/cairo-dock-plug-ins/cairo-dock-plug-ins/src/cairo-dock-plugins-3.0.0/gnome-integration-old/src/applet-gnome-vfs.c:24:
  300. /usr/include/libgnomeui-2.0/libgnomeui/gnome-entry.h:58:2: error: unknown type name ‘GtkCombo’
  301. /usr/include/libgnomeui-2.0/libgnomeui/gnome-entry.h:65:2: error: unknown type name ‘GtkComboClass’
  302. In file included from /usr/include/libgnomeui-2.0/libgnomeui/libgnomeui.h:49:0,
  303.                 from /tmp/packerbuild-0/cairo-dock-plug-ins/cairo-dock-plug-ins/src/cairo-dock-plugins-3.0.0/gnome-integration-old/src/applet-gnome-vfs.c:24:
  304. /usr/include/libgnomeui-2.0/libgnomeui/gnome-file-entry.h:60:2: error: unknown type name ‘GtkVBox’
  305. /usr/include/libgnomeui-2.0/libgnomeui/gnome-file-entry.h:77:2: error: unknown type name ‘GtkVBoxClass’
  306. In file included from /usr/include/libgnomeui-2.0/libgnomeui/libgnomeui.h:50:0,
  307.                 from /tmp/packerbuild-0/cairo-dock-plug-ins/cairo-dock-plug-ins/src/cairo-dock-plugins-3.0.0/gnome-integration-old/src/applet-gnome-vfs.c:24:
  308. /usr/include/libgnomeui-2.0/libgnomeui/gnome-font-picker.h:106:1: error: unknown type name ‘GdkFont’
  309. In file included from /usr/include/libgnomeui-2.0/libgnomeui/libgnomeui.h:51:0,
  310.                 from /tmp/packerbuild-0/cairo-dock-plug-ins/cairo-dock-plug-ins/src/cairo-dock-plugins-3.0.0/gnome-integration-old/src/applet-gnome-vfs.c:24:
  311. /usr/include/libgnomeui-2.0/libgnomeui/gnome-icon-entry.h:62:2: error: unknown type name ‘GtkVBox’
  312. /usr/include/libgnomeui-2.0/libgnomeui/gnome-icon-entry.h:69:2: error: unknown type name ‘GtkVBoxClass’
  313. In file included from /usr/include/libgnomeui-2.0/libgnomeui/libgnomeui.h:53:0,
  314.                 from /tmp/packerbuild-0/cairo-dock-plug-ins/cairo-dock-plug-ins/src/cairo-dock-plugins-3.0.0/gnome-integration-old/src/applet-gnome-vfs.c:24:
  315. /usr/include/libgnomeui-2.0/libgnomeui/gnome-icon-list.h:200:1: error: unknown type name ‘GtkVisibility’
  316. In file included from /usr/include/libgnomeui-2.0/libgnomeui/libgnomeui.h:54:0,
  317.                 from /tmp/packerbuild-0/cairo-dock-plug-ins/cairo-dock-plug-ins/src/cairo-dock-plugins-3.0.0/gnome-integration-old/src/applet-gnome-vfs.c:24:
  318. /usr/include/libgnomeui-2.0/libgnomeui/gnome-icon-sel.h:45:3: error: unknown type name ‘GtkVBox’
  319. /usr/include/libgnomeui-2.0/libgnomeui/gnome-icon-sel.h:52:3: error: unknown type name ‘GtkVBoxClass’
  320. In file included from /usr/include/libgnomeui-2.0/libgnomeui/libgnomeui.h:62:0,
  321.                 from /tmp/packerbuild-0/cairo-dock-plug-ins/cairo-dock-plug-ins/src/cairo-dock-plugins-3.0.0/gnome-integration-old/src/applet-gnome-vfs.c:24:
  322. /usr/include/libgnomeui-2.0/libgnomeui/gnome-client.h:107:3: error: unknown type name ‘GtkObject’
  323. /usr/include/libgnomeui-2.0/libgnomeui/gnome-client.h:167:3: error: unknown type name ‘GtkObjectClass’
  324. /usr/include/libgnomeui-2.0/libgnomeui/gnome-client.h:457:13: error: unknown type name ‘GtkCallbackMarshal’
  325. In file included from /usr/include/libgnomeui-2.0/libgnomeui/libgnomeui.h:63:0,
  326.                 from /tmp/packerbuild-0/cairo-dock-plug-ins/cairo-dock-plug-ins/src/cairo-dock-plugins-3.0.0/gnome-integration-old/src/applet-gnome-vfs.c:24:
  327. /usr/include/libgnomeui-2.0/libgnomeui/gnome-dateedit.h:56:2: error: unknown type name ‘GtkHBox’
  328. /usr/include/libgnomeui-2.0/libgnomeui/gnome-dateedit.h:63:2: error: unknown type name ‘GtkHBoxClass’
  329. In file included from /usr/include/libgnomeui-2.0/libgnomeui/libgnomeui.h:66:0,
  330.                 from /tmp/packerbuild-0/cairo-dock-plug-ins/cairo-dock-plug-ins/src/cairo-dock-plugins-3.0.0/gnome-integration-old/src/applet-gnome-vfs.c:24:
  331. /usr/include/libgnomeui-2.0/libgnomeui/gnome-dialog.h:106:13: error: unknown type name ‘GtkObject’
  332. In file included from /usr/include/libgnomeui-2.0/libgnomeui/gnome-mdi.h:34:0,
  333.                 from /usr/include/libgnomeui-2.0/libgnomeui/libgnomeui.h:73,
  334.                 from /tmp/packerbuild-0/cairo-dock-plug-ins/cairo-dock-plug-ins/src/cairo-dock-plugins-3.0.0/gnome-integration-old/src/applet-gnome-vfs.c:24:
  335. /usr/include/libgnomeui-2.0/libgnomeui/gnome-mdi-child.h:56:2: error: unknown type name ‘GtkObject’
  336. /usr/include/libgnomeui-2.0/libgnomeui/gnome-mdi-child.h:58:2: error: unknown type name ‘GtkObject’
  337. /usr/include/libgnomeui-2.0/libgnomeui/gnome-mdi-child.h:82:2: error: unknown type name ‘GtkObjectClass’
  338. In file included from /usr/include/libgnomeui-2.0/libgnomeui/libgnomeui.h:73:0,
  339.                 from /tmp/packerbuild-0/cairo-dock-plug-ins/cairo-dock-plug-ins/src/cairo-dock-plugins-3.0.0/gnome-integration-old/src/applet-gnome-vfs.c:24:
  340. /usr/include/libgnomeui-2.0/libgnomeui/gnome-mdi.h:56:2: error: unknown type name ‘GtkObject’
  341. /usr/include/libgnomeui-2.0/libgnomeui/gnome-mdi.h:89:2: error: unknown type name ‘GtkObjectClass’
  342. /usr/include/libgnomeui-2.0/libgnomeui/gnome-mdi.h:134:1: error: unknown type name ‘GtkObject’
  343. /usr/include/libgnomeui-2.0/libgnomeui/gnome-mdi.h:175:61: error: unknown type name ‘GtkObject’
  344. /usr/include/libgnomeui-2.0/libgnomeui/gnome-mdi.h:176:61: error: unknown type name ‘GtkObject’
  345. In file included from /usr/include/libgnomeui-2.0/libgnomeui/libgnomeui.h:75:0,
  346.                 from /tmp/packerbuild-0/cairo-dock-plug-ins/cairo-dock-plug-ins/src/cairo-dock-plugins-3.0.0/gnome-integration-old/src/applet-gnome-vfs.c:24:
  347. /usr/include/libgnomeui-2.0/libgnomeui/gnome-mdi-generic-child.h:60:2: error: unknown type name ‘GtkCallbackMarshal’
  348. /usr/include/libgnomeui-2.0/libgnomeui/gnome-mdi-generic-child.h:83:16: error: unknown type name ‘GtkCallbackMarshal’
  349. /usr/include/libgnomeui-2.0/libgnomeui/gnome-mdi-generic-child.h:91:16: error: unknown type name ‘GtkCallbackMarshal’
  350. /usr/include/libgnomeui-2.0/libgnomeui/gnome-mdi-generic-child.h:99:16: error: unknown type name ‘GtkCallbackMarshal’
  351. /usr/include/libgnomeui-2.0/libgnomeui/gnome-mdi-generic-child.h:107:16: error: unknown type name ‘GtkCallbackMarshal’
  352. In file included from /usr/include/cairo-dock/cairo-dock.h:86:0,
  353.                 from /tmp/packerbuild-0/cairo-dock-plug-ins/cairo-dock-plug-ins/src/cairo-dock-plugins-3.0.0/gnome-integration-old/src/applet-gnome-vfs.h:25,
  354.                 from /tmp/packerbuild-0/cairo-dock-plug-ins/cairo-dock-plug-ins/src/cairo-dock-plugins-3.0.0/gnome-integration-old/src/applet-gnome-vfs.c:27:
  355. /usr/include/cairo-dock/gldit/cairo-dock-applet-facility.h:845:0: warning: "D_" redefined [enabled by default]
  356. In file included from /usr/include/libgnomeui-2.0/libgnomeui/libgnomeui.h:35:0,
  357.                 from /tmp/packerbuild-0/cairo-dock-plug-ins/cairo-dock-plug-ins/src/cairo-dock-plugins-3.0.0/gnome-integration-old/src/applet-gnome-vfs.c:24:
  358. /usr/include/libgnomeui-2.0/libgnomeui/gnome-app-helper.h:545:0: note: this is the location of the previous definition
  359. make[2]: *** [gnome-integration-old/src/CMakeFiles/cd_gnome-integration-old.dir/applet-gnome-vfs.c.o] Error 1
  360. make[2]: *** Waiting for unfinished jobs....
  361. [ 40%] Building C object Impulse/src/CMakeFiles/cd-Impulse.dir/applet-config.c.o
  362. make[1]: *** [gnome-integration-old/src/CMakeFiles/cd_gnome-integration-old.dir/all] Error 2
  363. make[1]: *** Waiting for unfinished jobs....
  364. [ 40%] Building C object Impulse/src/CMakeFiles/cd-Impulse.dir/applet-notifications.c.o
  365. [ 41%] Building C object Impulse/src/CMakeFiles/cd-Impulse.dir/Impulse.c.o
  366. [ 41%] Building C object Impulse/src/CMakeFiles/cd-Impulse.dir/applet-impulse.c.o
  367. Linking C shared library libcd-Impulse.so
  368. [ 41%] Built target cd-Impulse
  369. make: *** [all] Error 2
  370. ==> ERROR: A failure occurred in build().
  371.    Aborting...
  372. The build failed.
clone this paste RAW Paste Data