Pastebin launched a little side project called HostCabi.net, check it out ;-)Don't like ads? PRO users don't see any ads ;-)
Guest

lib32-aspell-config.log

By: donniezazen on May 9th, 2013  |  syntax: None  |  size: 13.73 KB  |  hits: 37  |  expires: Never
download  |  raw  |  embed  |  report abuse  |  print
Text below is selected. Please press Ctrl+C to copy to your clipboard. (⌘+C on Mac)
  1. This file contains any messages produced by compilers while
  2. running configure, to aid debugging if configure makes a mistake.
  3.  
  4. It was created by GNU Aspell configure 0.60.6.1, which was
  5. generated by GNU Autoconf 2.61.  Invocation command line was
  6.  
  7.   $ ./configure --prefix=/usr --sysconfdir=/etc --libdir=/usr/lib32 --enable-dict-dir=/usr/lib/aspell-0.60
  8.  
  9. ## --------- ##
  10. ## Platform. ##
  11. ## --------- ##
  12.  
  13. hostname = donnie-laptop
  14. uname -m = x86_64
  15. uname -r = 3.8.11-1-ARCH
  16. uname -s = Linux
  17. uname -v = #1 SMP PREEMPT Wed May 1 20:18:57 CEST 2013
  18.  
  19. /usr/bin/uname -p = unknown
  20. /bin/uname -X     = unknown
  21.  
  22. /bin/arch              = unknown
  23. /usr/bin/arch -k       = unknown
  24. /usr/convex/getsysinfo = unknown
  25. /usr/bin/hostinfo      = unknown
  26. /bin/machine           = unknown
  27. /usr/bin/oslevel       = unknown
  28. /bin/universe          = unknown
  29.  
  30. PATH: /usr/local/bin
  31. PATH: /usr/bin
  32. PATH: /bin
  33. PATH: /usr/local/sbin
  34. PATH: /usr/sbin
  35. PATH: /sbin
  36. PATH: /usr/bin/core_perl
  37.  
  38.  
  39. ## ----------- ##
  40. ## Core tests. ##
  41. ## ----------- ##
  42.  
  43. configure:2025: checking build system type
  44. configure:2043: result: x86_64-unknown-linux-gnu
  45. configure:2065: checking host system type
  46. configure:2080: result: x86_64-unknown-linux-gnu
  47. configure:2102: checking target system type
  48. configure:2117: result: x86_64-unknown-linux-gnu
  49. configure:2160: checking for a BSD-compatible install
  50. configure:2216: result: /usr/bin/install -c
  51. configure:2227: checking whether build environment is sane
  52. configure:2270: result: yes
  53. configure:2404: checking for a thread-safe mkdir -p
  54. configure:2443: result: /usr/bin/mkdir -p
  55. configure:2456: checking for gawk
  56. configure:2472: found /usr/bin/gawk
  57. configure:2483: result: gawk
  58. configure:2494: checking whether make sets $(MAKE)
  59. configure:2515: result: yes
  60. configure:2600: checking whether to enable maintainer-specific portions of Makefiles
  61. configure:2609: result: no
  62. configure:2847: checking for C++ compiler version
  63. configure:2854: g++ -m32 --version >&5
  64. g++ (GCC) 4.8.0 20130502 (prerelease)
  65. Copyright (C) 2013 Free Software Foundation, Inc.
  66. This is free software; see the source for copying conditions.  There is NO
  67. warranty; not even for MERCHANTABILITY or FITNESS FOR A PARTICULAR PURPOSE.
  68.  
  69. configure:2857: $? = 0
  70. configure:2864: g++ -m32 -v >&5
  71. Using built-in specs.
  72. COLLECT_GCC=g++
  73. COLLECT_LTO_WRAPPER=/usr/lib/gcc/x86_64-unknown-linux-gnu/4.8.0/lto-wrapper
  74. Target: x86_64-unknown-linux-gnu
  75. Configured with: /build/src/gcc-4.8-20130502/configure --prefix=/usr --libdir=/usr/lib --libexecdir=/usr/lib --mandir=/usr/share/man --infodir=/usr/share/info --with-bugurl=https://bugs.archlinux.org/ --enable-languages=c,c++,ada,fortran,go,lto,objc,obj-c++ --enable-shared --enable-threads=posix --with-system-zlib --enable-__cxa_atexit --disable-libunwind-exceptions --enable-clocale=gnu --disable-libstdcxx-pch --enable-gnu-unique-object --enable-linker-build-id --enable-cloog-backend=isl --disable-cloog-version-check --enable-lto --enable-gold --enable-ld=default --enable-plugin --with-plugin-ld=ld.gold --with-linker-hash-style=gnu --disable-install-libiberty --disable-multilib --disable-libssp --disable-werror --enable-checking=release
  76. Thread model: posix
  77. gcc version 4.8.0 20130502 (prerelease) (GCC)
  78. configure:2867: $? = 0
  79. configure:2874: g++ -m32 -V >&5
  80. g++: error: unrecognized command line option '-V'
  81. g++: fatal error: no input files
  82. compilation terminated.
  83. configure:2877: $? = 1
  84. configure:2900: checking for C++ compiler default output file name
  85. configure:2927: g++ -m32 -march=x86-64 -mtune=generic -O2 -pipe -fstack-protector --param=ssp-buffer-size=4 -D_FORTIFY_SOURCE=2 -Wl,-O1,--sort-common,--as-needed,-z,relro conftest.cpp  >&5
  86. /usr/bin/ld: skipping incompatible /usr/lib/gcc/x86_64-unknown-linux-gnu/4.8.0/../../../../lib/libstdc++.so when searching for -lstdc++
  87. /usr/bin/ld: skipping incompatible /usr/lib/gcc/x86_64-unknown-linux-gnu/4.8.0/../../../../lib/libstdc++.a when searching for -lstdc++
  88. /usr/bin/ld: skipping incompatible /lib/../lib/libstdc++.so when searching for -lstdc++
  89. /usr/bin/ld: skipping incompatible /lib/../lib/libstdc++.a when searching for -lstdc++
  90. /usr/bin/ld: skipping incompatible /usr/lib/../lib/libstdc++.so when searching for -lstdc++
  91. /usr/bin/ld: skipping incompatible /usr/lib/../lib/libstdc++.a when searching for -lstdc++
  92. /usr/bin/ld: skipping incompatible /usr/lib/gcc/x86_64-unknown-linux-gnu/4.8.0/../../../libstdc++.so when searching for -lstdc++
  93. /usr/bin/ld: skipping incompatible /usr/lib/gcc/x86_64-unknown-linux-gnu/4.8.0/../../../libstdc++.a when searching for -lstdc++
  94. /usr/bin/ld: skipping incompatible /usr/lib/libstdc++.so when searching for -lstdc++
  95. /usr/bin/ld: skipping incompatible /usr/lib/libstdc++.a when searching for -lstdc++
  96. /usr/bin/ld: cannot find -lstdc++
  97. /usr/bin/ld: skipping incompatible /usr/lib/gcc/x86_64-unknown-linux-gnu/4.8.0/../../../../lib/libm.so when searching for -lm
  98. /usr/bin/ld: skipping incompatible /usr/lib/gcc/x86_64-unknown-linux-gnu/4.8.0/../../../../lib/libm.a when searching for -lm
  99. /usr/bin/ld: skipping incompatible /lib/../lib/libm.so when searching for -lm
  100. /usr/bin/ld: skipping incompatible /lib/../lib/libm.a when searching for -lm
  101. /usr/bin/ld: skipping incompatible /usr/lib/../lib/libm.so when searching for -lm
  102. /usr/bin/ld: skipping incompatible /usr/lib/../lib/libm.a when searching for -lm
  103. /usr/bin/ld: skipping incompatible /usr/lib/gcc/x86_64-unknown-linux-gnu/4.8.0/../../../libm.so when searching for -lm
  104. /usr/bin/ld: skipping incompatible /usr/lib/gcc/x86_64-unknown-linux-gnu/4.8.0/../../../libm.a when searching for -lm
  105. /usr/bin/ld: skipping incompatible /usr/lib/libm.so when searching for -lm
  106. /usr/bin/ld: skipping incompatible /usr/lib/libm.a when searching for -lm
  107. /usr/bin/ld: cannot find -lm
  108. /usr/bin/ld: skipping incompatible /usr/lib/gcc/x86_64-unknown-linux-gnu/4.8.0/../../../../lib/libgcc_s.so when searching for -lgcc_s
  109. /usr/bin/ld: skipping incompatible /lib/../lib/libgcc_s.so when searching for -lgcc_s
  110. /usr/bin/ld: skipping incompatible /usr/lib/../lib/libgcc_s.so when searching for -lgcc_s
  111. /usr/bin/ld: skipping incompatible /usr/lib/gcc/x86_64-unknown-linux-gnu/4.8.0/../../../libgcc_s.so when searching for -lgcc_s
  112. /usr/bin/ld: skipping incompatible /usr/lib/libgcc_s.so when searching for -lgcc_s
  113. /usr/bin/ld: cannot find -lgcc_s
  114. /usr/bin/ld: skipping incompatible /usr/lib/gcc/x86_64-unknown-linux-gnu/4.8.0/libgcc.a when searching for -lgcc
  115. /usr/bin/ld: cannot find -lgcc
  116. /usr/bin/ld: skipping incompatible /usr/lib/gcc/x86_64-unknown-linux-gnu/4.8.0/../../../../lib/libc.so when searching for -lc
  117. /usr/bin/ld: skipping incompatible /usr/lib/gcc/x86_64-unknown-linux-gnu/4.8.0/../../../../lib/libc.a when searching for -lc
  118. /usr/bin/ld: skipping incompatible /lib/../lib/libc.so when searching for -lc
  119. /usr/bin/ld: skipping incompatible /lib/../lib/libc.a when searching for -lc
  120. /usr/bin/ld: skipping incompatible /usr/lib/../lib/libc.so when searching for -lc
  121. /usr/bin/ld: skipping incompatible /usr/lib/../lib/libc.a when searching for -lc
  122. /usr/bin/ld: skipping incompatible /usr/lib/gcc/x86_64-unknown-linux-gnu/4.8.0/../../../libc.so when searching for -lc
  123. /usr/bin/ld: skipping incompatible /usr/lib/gcc/x86_64-unknown-linux-gnu/4.8.0/../../../libc.a when searching for -lc
  124. /usr/bin/ld: skipping incompatible /usr/lib/libc.so when searching for -lc
  125. /usr/bin/ld: skipping incompatible /usr/lib/libc.a when searching for -lc
  126. /usr/bin/ld: cannot find -lc
  127. /usr/bin/ld: skipping incompatible /usr/lib/gcc/x86_64-unknown-linux-gnu/4.8.0/../../../../lib/libgcc_s.so when searching for -lgcc_s
  128. /usr/bin/ld: skipping incompatible /lib/../lib/libgcc_s.so when searching for -lgcc_s
  129. /usr/bin/ld: skipping incompatible /usr/lib/../lib/libgcc_s.so when searching for -lgcc_s
  130. /usr/bin/ld: skipping incompatible /usr/lib/gcc/x86_64-unknown-linux-gnu/4.8.0/../../../libgcc_s.so when searching for -lgcc_s
  131. /usr/bin/ld: skipping incompatible /usr/lib/libgcc_s.so when searching for -lgcc_s
  132. /usr/bin/ld: cannot find -lgcc_s
  133. /usr/bin/ld: skipping incompatible /usr/lib/gcc/x86_64-unknown-linux-gnu/4.8.0/libgcc.a when searching for -lgcc
  134. /usr/bin/ld: cannot find -lgcc
  135. collect2: error: ld returned 1 exit status
  136. configure:2930: $? = 1
  137. configure:2968: result:
  138. configure: failed program was:
  139. | /* confdefs.h.  */
  140. | #define PACKAGE_NAME "GNU Aspell"
  141. | #define PACKAGE_TARNAME "aspell"
  142. | #define PACKAGE_VERSION "0.60.6.1"
  143. | #define PACKAGE_STRING "GNU Aspell 0.60.6.1"
  144. | #define PACKAGE_BUGREPORT ""
  145. | #define PACKAGE "aspell"
  146. | #define VERSION "0.60.6.1"
  147. | /* end confdefs.h.  */
  148. |
  149. | int
  150. | main ()
  151. | {
  152. |
  153. |   ;
  154. |   return 0;
  155. | }
  156. configure:2975: error: C++ compiler cannot create executables
  157. See `config.log' for more details.
  158.  
  159. ## ---------------- ##
  160. ## Cache variables. ##
  161. ## ---------------- ##
  162.  
  163. ac_cv_build=x86_64-unknown-linux-gnu
  164. ac_cv_env_CCC_set=
  165. ac_cv_env_CCC_value=
  166. ac_cv_env_CC_set=set
  167. ac_cv_env_CC_value='gcc -m32'
  168. ac_cv_env_CFLAGS_set=set
  169. ac_cv_env_CFLAGS_value='-march=x86-64 -mtune=generic -O2 -pipe -fstack-protector --param=ssp-buffer-size=4'
  170. ac_cv_env_CPPFLAGS_set=set
  171. ac_cv_env_CPPFLAGS_value=-D_FORTIFY_SOURCE=2
  172. ac_cv_env_CPP_set=
  173. ac_cv_env_CPP_value=
  174. ac_cv_env_CXXCPP_set=
  175. ac_cv_env_CXXCPP_value=
  176. ac_cv_env_CXXFLAGS_set=set
  177. ac_cv_env_CXXFLAGS_value='-march=x86-64 -mtune=generic -O2 -pipe -fstack-protector --param=ssp-buffer-size=4'
  178. ac_cv_env_CXX_set=set
  179. ac_cv_env_CXX_value='g++ -m32'
  180. ac_cv_env_LDFLAGS_set=set
  181. ac_cv_env_LDFLAGS_value=-Wl,-O1,--sort-common,--as-needed,-z,relro
  182. ac_cv_env_LIBS_set=
  183. ac_cv_env_LIBS_value=
  184. ac_cv_env_build_alias_set=
  185. ac_cv_env_build_alias_value=
  186. ac_cv_env_host_alias_set=
  187. ac_cv_env_host_alias_value=
  188. ac_cv_env_target_alias_set=
  189. ac_cv_env_target_alias_value=
  190. ac_cv_host=x86_64-unknown-linux-gnu
  191. ac_cv_path_install='/usr/bin/install -c'
  192. ac_cv_path_mkdir=/usr/bin/mkdir
  193. ac_cv_prog_AWK=gawk
  194. ac_cv_prog_make_make_set=yes
  195. ac_cv_target=x86_64-unknown-linux-gnu
  196.  
  197. ## ----------------- ##
  198. ## Output variables. ##
  199. ## ----------------- ##
  200.  
  201. ACLOCAL='${SHELL} /home/donnie/Downloads/lib32-aspell/src/aspell-0.60.6.1/missing --run aclocal-1.10'
  202. AMDEPBACKSLASH=''
  203. AMDEP_FALSE=''
  204. AMDEP_TRUE=''
  205. AMTAR='${SHELL} /home/donnie/Downloads/lib32-aspell/src/aspell-0.60.6.1/missing --run tar'
  206. AR=''
  207. AUTOCONF='${SHELL} /home/donnie/Downloads/lib32-aspell/src/aspell-0.60.6.1/missing --run autoconf'
  208. AUTOHEADER='${SHELL} /home/donnie/Downloads/lib32-aspell/src/aspell-0.60.6.1/missing --run autoheader'
  209. AUTOMAKE='${SHELL} /home/donnie/Downloads/lib32-aspell/src/aspell-0.60.6.1/missing --run automake-1.10'
  210. AWK='gawk'
  211. CC='gcc -m32'
  212. CCDEPMODE=''
  213. CFLAGS='-march=x86-64 -mtune=generic -O2 -pipe -fstack-protector --param=ssp-buffer-size=4'
  214. COMPILE_IN_FILTERS_FALSE=''
  215. COMPILE_IN_FILTERS_TRUE=''
  216. CPP=''
  217. CPPFLAGS='-D_FORTIFY_SOURCE=2'
  218. CURSES_INCLUDE=''
  219. CURSES_LIB=''
  220. CXX='g++ -m32'
  221. CXXCPP=''
  222. CXXDEPMODE=''
  223. CXXFLAGS='-march=x86-64 -mtune=generic -O2 -pipe -fstack-protector --param=ssp-buffer-size=4'
  224. CYGPATH_W='echo'
  225. DEFS=''
  226. DEPDIR=''
  227. DSYMUTIL=''
  228. DUMPBIN=''
  229. ECHO_C=''
  230. ECHO_N='-n'
  231. ECHO_T=''
  232. EGREP=''
  233. EXEEXT=''
  234. FGREP=''
  235. GMSGFMT=''
  236. GMSGFMT_015=''
  237. GREP=''
  238. INCREMENTED_SONAME_FALSE=''
  239. INCREMENTED_SONAME_TRUE=''
  240. INSTALL_DATA='${INSTALL} -m 644'
  241. INSTALL_PROGRAM='${INSTALL}'
  242. INSTALL_SCRIPT='${INSTALL}'
  243. INSTALL_STRIP_PROGRAM='$(install_sh) -c -s'
  244. INTLLIBS=''
  245. INTL_MACOSX_LIBS=''
  246. LD=''
  247. LDFLAGS='-Wl,-O1,--sort-common,--as-needed,-z,relro'
  248. LIBICONV=''
  249. LIBINTL=''
  250. LIBOBJS=''
  251. LIBS=''
  252. LIBTOOL=''
  253. LN_S=''
  254. LTLIBICONV=''
  255. LTLIBINTL=''
  256. LTLIBOBJS=''
  257. MAINT='#'
  258. MAINTAINER_MODE_FALSE=''
  259. MAINTAINER_MODE_TRUE='#'
  260. MAKEINFO='${SHELL} /home/donnie/Downloads/lib32-aspell/src/aspell-0.60.6.1/missing --run makeinfo'
  261. MSGFMT=''
  262. MSGFMT_015=''
  263. MSGMERGE=''
  264. NM=''
  265. NMEDIT=''
  266. OBJEXT=''
  267. PACKAGE='aspell'
  268. PACKAGE_BUGREPORT=''
  269. PACKAGE_NAME='GNU Aspell'
  270. PACKAGE_STRING='GNU Aspell 0.60.6.1'
  271. PACKAGE_TARNAME='aspell'
  272. PACKAGE_VERSION='0.60.6.1'
  273. PATH_SEPARATOR=':'
  274. PERLPROG=''
  275. POSUB=''
  276. PSPELL_COMPATIBILITY_FALSE=''
  277. PSPELL_COMPATIBILITY_TRUE=''
  278. PTHREAD_LIB=''
  279. RANLIB=''
  280. SED=''
  281. SET_MAKE=''
  282. SHELL='/bin/sh'
  283. STRIP=''
  284. USE_NLS=''
  285. VERSION='0.60.6.1'
  286. XGETTEXT=''
  287. XGETTEXT_015=''
  288. ac_ct_CC=''
  289. ac_ct_CXX=''
  290. ac_ct_DUMPBIN=''
  291. am__fastdepCC_FALSE=''
  292. am__fastdepCC_TRUE=''
  293. am__fastdepCXX_FALSE=''
  294. am__fastdepCXX_TRUE=''
  295. am__include=''
  296. am__isrc=''
  297. am__leading_dot='.'
  298. am__quote=''
  299. am__tar='${AMTAR} chof - "$$tardir"'
  300. am__untar='${AMTAR} xf -'
  301. bindir='${exec_prefix}/bin'
  302. build='x86_64-unknown-linux-gnu'
  303. build_alias=''
  304. build_cpu='x86_64'
  305. build_os='linux-gnu'
  306. build_vendor='unknown'
  307. datadir='${datarootdir}'
  308. datarootdir='${prefix}/share'
  309. docdir='${datarootdir}/doc/${PACKAGE_TARNAME}'
  310. dvidir='${docdir}'
  311. exec_prefix='NONE'
  312. host='x86_64-unknown-linux-gnu'
  313. host_alias=''
  314. host_cpu='x86_64'
  315. host_os='linux-gnu'
  316. host_vendor='unknown'
  317. htmldir='${docdir}'
  318. includedir='${prefix}/include'
  319. infodir='${datarootdir}/info'
  320. install_sh='$(SHELL) /home/donnie/Downloads/lib32-aspell/src/aspell-0.60.6.1/install-sh'
  321. libdir='/usr/lib32'
  322. libexecdir='${exec_prefix}/libexec'
  323. localedir='${datarootdir}/locale'
  324. localstatedir='${prefix}/var'
  325. lt_ECHO='echo'
  326. mandir='${datarootdir}/man'
  327. mkdir_p='/usr/bin/mkdir -p'
  328. oldincludedir='/usr/include'
  329. pdfdir='${docdir}'
  330. pkgdatadir='${libdir}/aspell-0.60'
  331. pkgdocdir='${prefix}/share/doc/aspell'
  332. pkglibdir='/usr/lib/aspell-0.60'
  333. prefix='/usr'
  334. program_transform_name='s,x,x,'
  335. psdir='${docdir}'
  336. sbindir='${exec_prefix}/sbin'
  337. sharedstatedir='${prefix}/com'
  338. sysconfdir='/etc'
  339. target='x86_64-unknown-linux-gnu'
  340. target_alias=''
  341. target_cpu='x86_64'
  342. target_os='linux-gnu'
  343. target_vendor='unknown'
  344.  
  345. ## ----------- ##
  346. ## confdefs.h. ##
  347. ## ----------- ##
  348.  
  349. #define PACKAGE_NAME "GNU Aspell"
  350. #define PACKAGE_TARNAME "aspell"
  351. #define PACKAGE_VERSION "0.60.6.1"
  352. #define PACKAGE_STRING "GNU Aspell 0.60.6.1"
  353. #define PACKAGE_BUGREPORT ""
  354. #define PACKAGE "aspell"
  355. #define VERSION "0.60.6.1"
  356.  
  357. configure: exit 77