Pastebin launched a little side project called VERYVIRAL.com, check it out ;-) Want more features on Pastebin? Sign Up, it's FREE!
Guest

Untitled

By: a guest on Feb 21st, 2012  |  syntax: None  |  size: 14.01 KB  |  views: 37  |  expires: Never
download  |  raw  |  embed  |  report abuse  |  print
Text below is selected. Please press Ctrl+C to copy to your clipboard. (⌘+C on Mac)
  1. [FAIL]
  2. Traceback (most recent call last):
  3.   File "/home/thijs/workspaces/opensource/software/twisted/svn/Twisted/branches/qt4reactor-pyside-3977/twisted/internet/test/test_core.py", line 287, in test_crash
  4.     self.assertFalse(reactor.running)
  5. twisted.trial.unittest.FailTest: None
  6.  
  7. twisted.internet.test.test_core.SystemEventTestsBuilder_QtReactor.test_crash
  8. ===============================================================================
  9. [FAIL]
  10. Traceback (most recent call last):
  11.   File "/home/thijs/workspaces/opensource/software/twisted/svn/Twisted/branches/qt4reactor-pyside-3977/twisted/internet/test/test_core.py", line 257, in test_runWithAsynchronousBeforeStartupTrigger
  12.     self.assertEqual(events, ['trigger', 'callback'])
  13. twisted.trial.unittest.FailTest: not equal:
  14. a = ['trigger']
  15. b = ['trigger', 'callback']
  16.  
  17.  
  18. twisted.internet.test.test_core.SystemEventTestsBuilder_QtReactor.test_runWithAsynchronousBeforeStartupTrigger
  19. ===============================================================================
  20. [FAIL]
  21. Traceback (most recent call last):
  22.   File "/home/thijs/workspaces/opensource/software/twisted/svn/Twisted/branches/qt4reactor-pyside-3977/twisted/internet/test/test_core.py", line 218, in test_shutdownDisconnectsCleanly
  23.     self.assertEqual(len(self.flushLoggedErrors(RuntimeError)), 1)
  24. twisted.trial.unittest.FailTest: not equal:
  25. a = 0
  26. b = 1
  27.  
  28.  
  29. twisted.internet.test.test_core.SystemEventTestsBuilder_QtReactor.test_shutdownDisconnectsCleanly
  30. ===============================================================================
  31. [FAIL]
  32. Traceback (most recent call last):
  33.   File "/home/thijs/workspaces/opensource/software/twisted/svn/Twisted/branches/qt4reactor-pyside-3977/twisted/internet/test/test_core.py", line 187, in test_shutdownFiresTriggersAsynchronously
  34.     self.assertEqual(events, ["stopped", "before shutdown"])
  35. twisted.trial.unittest.FailTest: not equal:
  36. a = ['stopped']
  37. b = ['stopped', 'before shutdown']
  38.  
  39.  
  40. twisted.internet.test.test_core.SystemEventTestsBuilder_QtReactor.test_shutdownFiresTriggersAsynchronously
  41. ===============================================================================
  42. [FAIL]
  43. Traceback (most recent call last):
  44.   File "/home/thijs/workspaces/opensource/software/twisted/svn/Twisted/branches/qt4reactor-pyside-3977/twisted/internet/test/test_core.py", line 169, in test_stopShutDownEvents
  45.     ("after", "shutdown")])
  46. twisted.trial.unittest.FailTest: not equal:
  47. a = []
  48. b = [('before', 'shutdown'), ('during', 'shutdown'), ('after', 'shutdown')]
  49.  
  50.  
  51. twisted.internet.test.test_core.SystemEventTestsBuilder_QtReactor.test_stopShutDownEvents
  52. ===============================================================================
  53. [FAIL]
  54. Traceback (most recent call last):
  55.   File "/home/thijs/workspaces/opensource/software/twisted/svn/Twisted/branches/qt4reactor-pyside-3977/twisted/internet/test/test_process.py", line 131, in test_spawnProcessEarlyIsReaped
  56.     self.assertTrue(result)
  57. twisted.trial.unittest.FailTest: None
  58.  
  59. twisted.internet.test.test_process.PTYProcessTestsBuilder_QtReactor.test_spawnProcessEarlyIsReaped
  60. ===============================================================================
  61. [FAIL]
  62. Traceback (most recent call last):
  63.   File "/home/thijs/workspaces/opensource/software/twisted/svn/Twisted/branches/qt4reactor-pyside-3977/twisted/internet/test/test_tcp.py", line 169, in test_addresses
  64.     IPv4Address('TCP', '127.0.0.1', port))
  65. twisted.trial.unittest.FailTest: not equal:
  66. a = None
  67. b = IPv4Address(TCP, '127.0.0.1', 35542)
  68.  
  69.  
  70. twisted.internet.test.test_tcp.TCPClientTestsBuilder_QtReactor.test_addresses
  71. ===============================================================================
  72. [FAIL]
  73. Traceback (most recent call last):
  74.   File "/home/thijs/workspaces/opensource/software/twisted/svn/Twisted/branches/qt4reactor-pyside-3977/twisted/internet/test/test_tcp.py", line 198, in test_connectEvent
  75.     self.assertTrue(connected)
  76. twisted.trial.unittest.FailTest: None
  77.  
  78. twisted.internet.test.test_tcp.TCPClientTestsBuilder_QtReactor.test_connectEvent
  79. ===============================================================================
  80. [FAIL]
  81. Traceback (most recent call last):
  82.   File "/home/thijs/workspaces/opensource/software/twisted/svn/Twisted/branches/qt4reactor-pyside-3977/twisted/internet/test/test_tcp.py", line 361, in test_connectionLostLogMsg
  83.     self.assertIn(expectedMessage, loggedMessages)
  84. twisted.trial.unittest.FailTest: '(TCP Port 46777 Closed)' not in []
  85.  
  86. twisted.internet.test.test_tcp.TCPPortTestsBuilder_QtReactor.test_connectionLostLogMsg
  87. ===============================================================================
  88. [FAIL]
  89. Traceback (most recent call last):
  90.   File "/home/thijs/workspaces/opensource/software/twisted/svn/Twisted/branches/qt4reactor-pyside-3977/twisted/internet/test/test_threads.py", line 49, in test_getThreadPool
  91.     "Pool should be stopped after reactor.run returns")
  92. twisted.trial.unittest.FailTest: Pool should be stopped after reactor.run returns
  93.  
  94. twisted.internet.test.test_threads.ThreadTestsBuilder_QtReactor.test_getThreadPool
  95. ===============================================================================
  96. [FAIL]
  97. Traceback (most recent call last):
  98.   File "/home/thijs/workspaces/opensource/software/twisted/svn/Twisted/branches/qt4reactor-pyside-3977/twisted/internet/test/test_threads.py", line 120, in test_stopThreadPool
  99.     self.assertIdentical(threadpool(), None)
  100. twisted.trial.unittest.FailTest: <twisted.python.threadpool.ThreadPool instance at 0x81f7ef0> is not None
  101.  
  102. twisted.internet.test.test_threads.ThreadTestsBuilder_QtReactor.test_stopThreadPool
  103. ===============================================================================
  104. [FAIL]
  105. Traceback (most recent call last):
  106.   File "/home/thijs/workspaces/opensource/software/twisted/svn/Twisted/branches/qt4reactor-pyside-3977/twisted/internet/test/test_threads.py", line 143, in test_stopThreadPoolWhenStartedAfterReactorRan
  107.     self.assertIdentical(threadPoolRefs[0](), None)
  108. twisted.trial.unittest.FailTest: <twisted.python.threadpool.ThreadPool instance at 0x7c82758> is not None
  109.  
  110. twisted.internet.test.test_threads.ThreadTestsBuilder_QtReactor.test_stopThreadPoolWhenStartedAfterReactorRan
  111. ===============================================================================
  112. [FAIL]
  113. Traceback (most recent call last):
  114.   File "/home/thijs/workspaces/opensource/software/twisted/svn/Twisted/branches/qt4reactor-pyside-3977/twisted/internet/test/test_tcp.py", line 361, in test_connectionLostLogMsg
  115.     self.assertIn(expectedMessage, loggedMessages)
  116. twisted.trial.unittest.FailTest: "(UNIX Port 'twisted.internet.test.test_unix/UNIXPortTestsBuilder_QtReactor/test_connectionLostLogMsg/HwZuYP/temp' Closed)" not in []
  117.  
  118. twisted.internet.test.test_unix.UNIXPortTestsBuilder_QtReactor.test_connectionLostLogMsg
  119. ===============================================================================
  120. [ERROR]
  121. Traceback (most recent call last):
  122.   File "/home/thijs/workspaces/opensource/software/twisted/svn/Twisted/branches/qt4reactor-pyside-3977/twisted/python/log.py", line 84, in callWithLogger
  123.     return callWithContext({"system": lp}, func, *args, **kw)
  124.   File "/home/thijs/workspaces/opensource/software/twisted/svn/Twisted/branches/qt4reactor-pyside-3977/twisted/python/log.py", line 69, in callWithContext
  125.     return context.call({ILogContext: newCtx}, func, *args, **kw)
  126.   File "/home/thijs/workspaces/opensource/software/twisted/svn/Twisted/branches/qt4reactor-pyside-3977/twisted/python/context.py", line 59, in callWithContext
  127.     return self.currentContext().callWithContext(ctx, func, *args, **kw)
  128.   File "/home/thijs/workspaces/opensource/software/twisted/svn/Twisted/branches/qt4reactor-pyside-3977/twisted/python/context.py", line 37, in callWithContext
  129.     return func(*args,**kw)
  130.   File "/home/thijs/workspaces/opensource/software/twisted/svn/Twisted/branches/qt4reactor-pyside-3977/twisted/internet/test/test_core.py", line 201, in connectionLost
  131.     raise RuntimeError("simulated connectionLost error")
  132. exceptions.RuntimeError: simulated connectionLost error
  133.  
  134. twisted.internet.test.test_core.SystemEventTestsBuilder_QtReactor.test_shutdownDisconnectsCleanly
  135. ===============================================================================
  136. [ERROR]
  137. Traceback (most recent call last):
  138.   File "/home/thijs/workspaces/opensource/software/twisted/svn/Twisted/branches/qt4reactor-pyside-3977/twisted/internet/_baseprocess.py", line 60, in maybeCallProcessEnded
  139.     proto.processEnded(Failure(reason))
  140.   File "/home/thijs/workspaces/opensource/software/twisted/svn/Twisted/branches/qt4reactor-pyside-3977/twisted/internet/test/test_process.py", line 286, in processEnded
  141.     checkOutput("".join(self.output))
  142.   File "/home/thijs/workspaces/opensource/software/twisted/svn/Twisted/branches/qt4reactor-pyside-3977/twisted/internet/test/test_process.py", line 273, in checkOutput
  143.     self.assertEquals('[0, 1, 2, 3]', output)
  144. twisted.trial.unittest.FailTest: not equal:
  145. a = '[0, 1, 2, 3]'
  146. b = ''
  147.  
  148.  
  149. twisted.internet.test.test_process.PTYProcessTestsBuilder_QtReactor.test_openFileDescriptors
  150. twisted.internet.test.test_process.ProcessTestsBuilder_QtReactor.test_openFileDescriptors
  151. ===============================================================================
  152. [ERROR]
  153. Traceback (most recent call last):
  154.   File "/home/thijs/workspaces/opensource/software/twisted/svn/Twisted/branches/qt4reactor-pyside-3977/twisted/internet/test/test_process.py", line 197, in cbExited
  155.     self.assertEqual(err.signal, sigNum)
  156. twisted.trial.unittest.FailTest: not equal:
  157. a = 1
  158. b = 15
  159.  
  160.  
  161. twisted.internet.test.test_process.PTYProcessTestsBuilder_QtReactor.test_processExitedWithSignal
  162. ===============================================================================
  163. [ERROR]
  164. Traceback (most recent call last):
  165.   File "/home/thijs/workspaces/opensource/software/twisted/svn/Twisted/branches/qt4reactor-pyside-3977/twisted/internet/test/test_process.py", line 539, in processFinished
  166.     self.assertEquals(args, output)
  167. twisted.trial.unittest.FailTest: not equal:
  168. a = ['hello',
  169.  '"',
  170.  ' \t|<>^&',
  171.  '"\\\\"hello\\\\"',
  172.  '"foo\\ bar baz\\""',
  173.  '\x01\x02\x03\x04\x05\x06\x07\x08\t\n\x0b\x0c\r\x0e\x0f\x10\x11\x12\x13\x14\x15\x16\x17\x18\x19\x1a\x1b\x1c\x1d\x1e\x1f !"#$%&\'()*+,-./0123456789:;<=>?@ABCDEFGHIJKLMNOPQRSTUVWXYZ[\\]^_`abcdefghijklmnopqrstuvwxyz{|}~\x7f\x80\x81\x82\x83\x84\x85\x86\x87\x88\x89\x8a\x8b\x8c\x8d\x8e\x8f\x90\x91\x92\x93\x94\x95\x96\x97\x98\x99\x9a\x9b\x9c\x9d\x9e\x9f\xa0\xa1\xa2\xa3\xa4\xa5\xa6\xa7\xa8\xa9\xaa\xab\xac\xad\xae\xaf\xb0\xb1\xb2\xb3\xb4\xb5\xb6\xb7\xb8\xb9\xba\xbb\xbc\xbd\xbe\xbf\xc0\xc1\xc2\xc3\xc4\xc5\xc6\xc7\xc8\xc9\xca\xcb\xcc\xcd\xce\xcf\xd0\xd1\xd2\xd3\xd4\xd5\xd6\xd7\xd8\xd9\xda\xdb\xdc\xdd\xde\xdf\xe0\xe1\xe2\xe3\xe4\xe5\xe6\xe7\xe8\xe9\xea\xeb\xec\xed\xee\xef\xf0\xf1\xf2\xf3\xf4\xf5\xf6\xf7\xf8\xf9\xfa\xfb\xfc\xfd\xfe\xff']
  174. b = []
  175.  
  176.  
  177. twisted.internet.test.test_process.ProcessTestsBuilder_QtReactor.test_processCommandLineArguments
  178. ===============================================================================
  179. [ERROR]
  180. Traceback (most recent call last):
  181.   File "/home/thijs/workspaces/opensource/software/twisted/svn/Twisted/branches/qt4reactor-pyside-3977/twisted/internet/test/test_process.py", line 447, in cbExited
  182.     self.assertEqual(lost, [])
  183. twisted.trial.unittest.FailTest: not equal:
  184. a = [0, 1, 2]
  185. b = []
  186.  
  187.  
  188. twisted.internet.test.test_process.ProcessTestsBuilder_QtReactor.test_processExited
  189. ===============================================================================
  190. [ERROR]
  191. Traceback (most recent call last):
  192.   File "/home/thijs/workspaces/opensource/software/twisted/svn/Twisted/branches/qt4reactor-pyside-3977/twisted/internet/test/test_process.py", line 197, in cbExited
  193.     self.assertEqual(err.signal, sigNum)
  194. twisted.trial.unittest.FailTest: not equal:
  195. a = None
  196. b = 15
  197.  
  198.  
  199. twisted.internet.test.test_process.ProcessTestsBuilder_QtReactor.test_processExitedWithSignal
  200. ===============================================================================
  201. [ERROR]
  202. Traceback (most recent call last):
  203.   File "/home/thijs/workspaces/opensource/software/twisted/svn/Twisted/branches/qt4reactor-pyside-3977/twisted/internet/test/test_process.py", line 492, in cbProcessExited
  204.     self.assertEqual(out, SHEBANG_OUTPUT)
  205. twisted.trial.unittest.FailTest: not equal:
  206. a = ''
  207. b = 'this is the shebang output'
  208.  
  209.  
  210. twisted.internet.test.test_process.ProcessTestsBuilder_QtReactor.test_shebang
  211. ===============================================================================
  212. [ERROR]
  213. Traceback (most recent call last):
  214.   File "/home/thijs/workspaces/opensource/software/twisted/svn/Twisted/branches/qt4reactor-pyside-3977/twisted/internet/test/test_qtreactor.py", line 31, in test_importQtreactor
  215.     from twisted.plugins.twisted_qtstub import errorMessage
  216. exceptions.ImportError: No module named twisted_qtstub
  217.  
  218. twisted.internet.test.test_qtreactor.QtreactorTestCase.test_importQtreactor
  219. ===============================================================================
  220. [ERROR]
  221. Traceback (most recent call last):
  222.   File "/home/thijs/workspaces/opensource/software/twisted/svn/Twisted/branches/qt4reactor-pyside-3977/twisted/internet/test/test_tcp.py", line 245, in test_unregisterProducerAfterDisconnect
  223.     writing[0], "Transport was writing after unregisterProducer.")
  224. exceptions.IndexError: list index out of range
  225.  
  226. twisted.internet.test.test_tcp.TCPClientTestsBuilder_QtReactor.test_unregisterProducerAfterDisconnect
  227. ===============================================================================
  228. [ERROR]
  229. Traceback (most recent call last):
  230.   File "/home/thijs/workspaces/opensource/software/twisted/svn/Twisted/branches/qt4reactor-pyside-3977/twisted/internet/test/test_tls.py", line 159, in test_disconnectAfterWriteAfterStartTLS
  231.     lostConnectionResults[0].trap(ConnectionClosed)
  232. exceptions.IndexError: list index out of range
  233.  
  234. twisted.internet.test.test_tls.SSLClientTestsMixin_QtReactor.test_disconnectAfterWriteAfterStartTLS
  235. -------------------------------------------------------------------------------
  236. Ran 6897 tests in 76.736s
  237.  
  238. FAILED (skips=767, expectedFailures=18, failures=13, errors=11, successes=6089)
clone this paste RAW Paste Data