Pastebin launched a little side project called, check it out ;-) Want more features on Pastebin? Sign Up, it's FREE!


By: kuglee on Feb 26th, 2012  |  syntax: None  |  size: 1.75 KB  |  views: 60  |  expires: Never
download  |  raw  |  embed  |  report abuse  |  print
Text below is selected. Please press Ctrl+C to copy to your clipboard. (⌘+C on Mac)
  1. helpviewer_qwv.cpp:168:1: error: expected class-name before ‘{’ token
  2. helpviewer_qwv.cpp:173:13: error: ‘QWebPage’ does not name a type
  3. helpviewer_qwv.cpp:174:32: error: ‘WebAction’ has not been declared
  4. helpviewer_qwv.cpp:176:42: error: ‘QWebFrame’ has not been declared
  5. helpviewer_qwv.cpp:177:41: error: ‘NavigationType’ has not been declared
  6. helpviewer_qwv.cpp: In constructor ‘HelpPage::HelpPage(QObject*)’:
  7. helpviewer_qwv.cpp:189:7: error: class ‘HelpPage’ does not have any field named ‘QWebPage’
  8. helpviewer_qwv.cpp: At global scope:
  9. helpviewer_qwv.cpp:197:1: error: ‘QWebPage’ does not name a type
  10. helpviewer_qwv.cpp:207:30: error: variable or field ‘triggerAction’ declared void
  11. helpviewer_qwv.cpp:207:30: error: ‘WebAction’ was not declared in this scope
  12. helpviewer_qwv.cpp:207:48: error: expected primary-expression before ‘bool’
  13. make[4]: *** [.obj/release-shared/helpviewer_qwv.o] Error 1
  14. make[4]: Leaving directory `/media/downloads/chenxiaolong-Unity-for-Arch-0d2972a/qt-ubuntu/src/qt-everywhere-opensource-src-4.8.0/tools/assistant/tools/assistant'
  15. make[3]: *** [sub-assistant-make_default-ordered] Error 2
  16. make[3]: Leaving directory `/media/downloads/chenxiaolong-Unity-for-Arch-0d2972a/qt-ubuntu/src/qt-everywhere-opensource-src-4.8.0/tools/assistant/tools'
  17. make[2]: *** [sub-tools-make_default-ordered] Error 2
  18. make[2]: Leaving directory `/media/downloads/chenxiaolong-Unity-for-Arch-0d2972a/qt-ubuntu/src/qt-everywhere-opensource-src-4.8.0/tools/assistant'
  19. make[1]: *** [sub-assistant-make_default-ordered] Error 2
  20. make[1]: Leaving directory `/media/downloads/chenxiaolong-Unity-for-Arch-0d2972a/qt-ubuntu/src/qt-everywhere-opensource-src-4.8.0/tools'
  21. make: *** [sub-tools-make_default-ordered] Error 2
clone this paste RAW Paste Data