Pastebin launched a little side project called HostCabi.net, check it out ;-)Don't like ads? PRO users don't see any ads ;-)
Guest

Untitled

By: a guest on Apr 20th, 2012  |  syntax: None  |  size: 4.08 KB  |  hits: 68  |  expires: Never
download  |  raw  |  embed  |  report abuse  |  print
Text below is selected. Please press Ctrl+C to copy to your clipboard. (⌘+C on Mac)
  1. /bin/sh ../libtool --tag=CXX   --mode=compile g++ -DHAVE_CONFIG_H -I.    -I/usr/x86_64-unknown-linux-gnu/avr/include -g -O2 -Icmd -Iui -Ihwtimer -MT string2.lo -MD -MP -MF .deps/string2.Tpo -c -o string2.lo string2.cpp
  2. libtool: compile:  g++ -DHAVE_CONFIG_H -I. -I/usr/x86_64-unknown-linux-gnu/avr/include -g -O2 -Icmd -Iui -Ihwtimer -MT string2.lo -MD -MP -MF .deps/string2.Tpo -c string2.cpp  -fPIC -DPIC -o .libs/string2.o
  3. mv -f .deps/specialmem.Tpo .deps/specialmem.Plo
  4. /bin/sh ../libtool --tag=CXX   --mode=compile g++ -DHAVE_CONFIG_H -I.    -I/usr/x86_64-unknown-linux-gnu/avr/include -g -O2 -Icmd -Iui -Ihwtimer -MT systemclock.lo -MD -MP -MF .deps/systemclock.Tpo -c -o systemclock.lo systemclock.cpp
  5. libtool: compile:  g++ -DHAVE_CONFIG_H -I. -I/usr/x86_64-unknown-linux-gnu/avr/include -g -O2 -Icmd -Iui -Ihwtimer -MT systemclock.lo -MD -MP -MF .deps/systemclock.Tpo -c systemclock.cpp  -fPIC -DPIC -o .libs/systemclock.o
  6. libtool: compile:  g++ -DHAVE_CONFIG_H -I. -I/usr/x86_64-unknown-linux-gnu/avr/include -g -O2 -Icmd -Iui -Ihwtimer -MT string2.lo -MD -MP -MF .deps/string2.Tpo -c string2.cpp -o string2.o >/dev/null 2>&1
  7. mv -f .deps/string2.Tpo .deps/string2.Plo
  8. /bin/sh ../libtool --tag=CXX   --mode=compile g++ -DHAVE_CONFIG_H -I.    -I/usr/x86_64-unknown-linux-gnu/avr/include -g -O2 -Icmd -Iui -Ihwtimer -MT traceval.lo -MD -MP -MF .deps/traceval.Tpo -c -o traceval.lo traceval.cpp
  9. libtool: compile:  g++ -DHAVE_CONFIG_H -I. -I/usr/x86_64-unknown-linux-gnu/avr/include -g -O2 -Icmd -Iui -Ihwtimer -MT traceval.lo -MD -MP -MF .deps/traceval.Tpo -c traceval.cpp  -fPIC -DPIC -o .libs/traceval.o
  10. mv -f .deps/serialrx.Tpo .deps/serialrx.Plo
  11. /bin/sh ../libtool  --tag=CXX   --mode=compile g++ -DHAVE_CONFIG_H -I.    -I/usr/x86_64-unknown-linux-gnu/avr/include -g -O2 -Icmd -Iui -Ihwtimer -MT ui.lo -MD -MP -MF .deps/ui.Tpo -c -o ui.lo `test -f 'ui/ui.cpp' || echo './'`ui/ui.cpp
  12. mv -f .deps/spisink.Tpo .deps/spisink.Plo
  13. g++ -DHAVE_CONFIG_H -I.    -I/usr/x86_64-unknown-linux-gnu/avr/include -g -O2 -Icmd -Iui -Ihwtimer -MT main.o -MD -MP -MF .deps/main.Tpo -c -o main.o `test -f 'cmd/main.cpp' || echo './'`cmd/main.cpp
  14. libtool: compile:  g++ -DHAVE_CONFIG_H -I. -I/usr/x86_64-unknown-linux-gnu/avr/include -g -O2 -Icmd -Iui -Ihwtimer -MT ui.lo -MD -MP -MF .deps/ui.Tpo -c ui/ui.cpp  -fPIC -DPIC -o .libs/ui.o
  15. systemclock.cpp: En la instanciación de ‘void MinHeap<Key, Value>::Insert(Key, Value) [with Key = long long int; Value = SimulationMember*]’:
  16. systemclock.cpp:135:40:   se requiere desde aquí
  17. systemclock.cpp:70:2: error: ‘resize’ no se declaró en este ámbito, y no se encontraron declaraciones en la búsqueda dependiente de argumentos en el punto de la instanciación [-fpermissive]
  18. systemclock.cpp:70:2: nota: no se encontraron declaraciones en la base dependiente ‘std::vector<std::pair<long long int, SimulationMember*>, std::allocator<std::pair<long long int, SimulationMember*> > >’ pur la búsqueda no calificada
  19. systemclock.cpp:70:2: nota: use ‘this->resize’ en su lugar
  20. make[3]: *** [systemclock.lo] Error 1
  21. make[3]: *** Se espera a que terminen otras tareas....
  22. mv -f .deps/serialtx.Tpo .deps/serialtx.Plo
  23. libtool: compile:  g++ -DHAVE_CONFIG_H -I. -I/usr/x86_64-unknown-linux-gnu/avr/include -g -O2 -Icmd -Iui -Ihwtimer -MT ui.lo -MD -MP -MF .deps/ui.Tpo -c ui/ui.cpp -o ui.o >/dev/null 2>&1
  24. mv -f .deps/keyboard.Tpo .deps/keyboard.Plo
  25. mv -f .deps/main.Tpo .deps/main.Po
  26. mv -f .deps/ui.Tpo .deps/ui.Plo
  27. libtool: compile:  g++ -DHAVE_CONFIG_H -I. -I/usr/x86_64-unknown-linux-gnu/avr/include -g -O2 -Icmd -Iui -Ihwtimer -MT traceval.lo -MD -MP -MF .deps/traceval.Tpo -c traceval.cpp -o traceval.o >/dev/null 2>&1
  28. mv -f .deps/traceval.Tpo .deps/traceval.Plo
  29. make[3]: se sale del directorio `/home/sergio/repo/build/simulavr/src/simulavr-1.0.0/src'
  30. make[2]: *** [all-recursive] Error 1
  31. make[2]: se sale del directorio `/home/sergio/repo/build/simulavr/src/simulavr-1.0.0/src'
  32. make[1]: *** [all] Error 2
  33. make[1]: se sale del directorio `/home/sergio/repo/build/simulavr/src/simulavr-1.0.0/src'
  34. make: *** [all-recursive] Error 1
  35. ==> ERROR: Se produjo un error en build().
  36.     Cancelando...