Pastebin launched a little side project called HostCabi.net, check it out ;-)Don't like ads? PRO users don't see any ads ;-)
Guest

Untitled

By: a guest on Jun 21st, 2010  |  syntax: None  |  size: 10.78 KB  |  hits: 75  |  expires: Never
download  |  raw  |  embed  |  report abuse  |  print
Text below is selected. Please press Ctrl+C to copy to your clipboard. (⌘+C on Mac)
  1. ==> Determining latest git revision...
  2.   -> Version found: 20100621
  3. ==> Making package: lightspark-git 20100621-1 i686 (Mon Jun 21 23:30:42 KST 2010)
  4. ==> Checking Runtime Dependencies...
  5. ==> Checking Buildtime Dependencies...
  6. ==> Retrieving Sources...
  7. ==> Extracting Sources...
  8. ==> Removing existing pkg/ directory...
  9. ==> Starting build()...
  10.   -> Connecting to github....
  11. Already up-to-date.
  12.   -> Git checkout done or server timeout
  13. Initialized empty Git repository in /home/jdi/x/src/lightspark-build/.git/
  14.   -> Patching...
  15.   -> Starting make...
  16. -- The C compiler identification is GNU
  17. -- The CXX compiler identification is GNU
  18. -- Check for working C compiler: /usr/bin/gcc
  19. -- Check for working C compiler: /usr/bin/gcc -- works
  20. -- Detecting C compiler ABI info
  21. -- Detecting C compiler ABI info - done
  22. -- Check for working CXX compiler: /usr/bin/c++
  23. -- Check for working CXX compiler: /usr/bin/c++ -- works
  24. -- Detecting CXX compiler ABI info
  25. -- Detecting CXX compiler ABI info - done
  26. -- Found assembler: /usr/bin/nasm
  27. -- Found assembler: /usr/bin/nasm
  28. -- Loaded CMakeASM-NASMInformation - ASM-NASM support is still experimental, please report issues
  29. -- LLVM llvm-config found at: /usr/bin/llvm-config
  30. -- LLVM version: 2.7
  31. -- LLVM CXX flags: -I/usr/include  -DNDEBUG -D_GNU_SOURCE -D__STDC_LIMIT_MACROS -D__STDC_CONSTANT_MACROS -O2 -fomit-frame-pointer -fno-exceptions -fno-rtti -fPIC -Woverloaded-virtual
  32. -- LLVM LD flags: -L/usr/lib/llvm  -lpthread -lffi -ldl -lm
  33. -- LLVM core libs: -lLLVMLinker -lLLVMArchive -lLLVMBitWriter -lLLVMBitReader -lLLVMInstrumentation -lLLVMipo -lLLVMTransformUtils -lLLVMipa -lLLVMAnalysis -lLLVMTarget -lLLVMMC -lLLVMCore -lLLVMSupport -lLLVMSystem
  34. -- LLVM JIT libs: -lLLVMX86Disassembler -lLLVMX86AsmParser -lLLVMMCParser -lLLVMX86AsmPrinter -lLLVMX86CodeGen -lLLVMSelectionDAG -lLLVMAsmPrinter -lLLVMX86Info -lLLVMJIT -lLLVMExecutionEngine -lLLVMCodeGen -lLLVMScalarOpts -lLLVMInstCombine -lLLVMTransformUtils -lLLVMipa -lLLVMAnalysis -lLLVMTarget -lLLVMMC -lLLVMCore -lLLVMSupport -lLLVMSystem
  35. -- LLVM JIT objs:
  36. -- Found LLVM: /usr/include
  37. -- Looking for include files CMAKE_HAVE_PTHREAD_H
  38. -- Looking for include files CMAKE_HAVE_PTHREAD_H - found
  39. -- Looking for pthread_create in pthreads
  40. -- Looking for pthread_create in pthreads - not found
  41. -- Looking for pthread_create in pthread
  42. -- Looking for pthread_create in pthread - found
  43. -- Found Threads: TRUE
  44. -- Found CURL: /usr/lib/libcurl.so
  45. -- Found ZLIB: /usr/lib/libz.so
  46. -- checking for modules 'gl;libpcrecpp;libavcodec;libavutil;ftgl;x11;glu;fontconfig'
  47. --   found gl, version 7.8.2
  48. --   found libpcrecpp, version 8.02
  49. --   found libavcodec, version 52.76.0
  50. --   found libavutil, version 50.19.0
  51. --   found ftgl, version 2.1.3~rc5
  52. --   found x11, version 1.3.4
  53. --   found glu, version 7.8.2
  54. --   found fontconfig, version 2.8.0
  55. -- checking for module 'libpulse'
  56. --   found libpulse, version 0.9.21
  57. -- checking for modules 'gtk+-2.0;gtkglext-1.0'
  58. --   found gtk+-2.0, version 2.20.1
  59. --   found gtkglext-1.0, version 1.2.0
  60. -- checking for modules 'nspr;mozilla-plugin'
  61. --   found nspr, version 4.8.4
  62. --   found mozilla-plugin, version 1.9.2
  63. -- Configuring done
  64. -- Generating done
  65. -- Build files have been written to: /home/jdi/x/src/lightspark-build
  66. Scanning dependencies of target spark
  67. [  2%] Building CXX object CMakeFiles/spark.dir/swf.cpp.o                                                                    
  68. [  4%] Building CXX object CMakeFiles/spark.dir/swftypes.cpp.o                                                                
  69. [  6%] Building CXX object CMakeFiles/spark.dir/tags.cpp.o                                                                    
  70. [  9%] Building CXX object CMakeFiles/spark.dir/geometry.cpp.o                                                                
  71. [ 11%] Building CXX object CMakeFiles/spark.dir/actions.cpp.o                                                                
  72. [ 13%] Building CXX object CMakeFiles/spark.dir/frame.cpp.o                                                                  
  73. [ 16%] Building CXX object CMakeFiles/spark.dir/input.cpp.o                                                                  
  74. [ 18%] Building CXX object CMakeFiles/spark.dir/streams.cpp.o                                                                
  75. [ 20%] Building CXX object CMakeFiles/spark.dir/tags_stub.cpp.o                                                              
  76. [ 23%] Building CXX object CMakeFiles/spark.dir/logger.cpp.o                                                                  
  77. [ 25%] Building CXX object CMakeFiles/spark.dir/vm.cpp.o                                                                      
  78. [ 27%] Building CXX object CMakeFiles/spark.dir/asobjects.cpp.o                                                              
  79. [ 30%] Building CXX object CMakeFiles/spark.dir/abc.cpp.o                                                                    
  80. [ 32%] Building CXX object CMakeFiles/spark.dir/abc_codesynt.cpp.o                                                            
  81. /home/jdi/x/src/lightspark-build/abc_codesynt.cpp: In member function ‘lightspark::ASObject* (* lightspark::method_info::synt_method())(lightspark::call_context*)’:
  82. /home/jdi/x/src/lightspark-build/abc_codesynt.cpp:1611:53: warning: passing NULL to non-pointer argument 2 of ‘static llvm::Constant* llvm::ConstantInt::get(const llvm::Type*, uint64_t, bool)’
  83. /home/jdi/x/src/lightspark-build/abc_codesynt.cpp:2606:53: warning: passing NULL to non-pointer argument 2 of ‘static llvm::Constant* llvm::ConstantInt::get(const llvm::Type*, uint64_t, bool)’
  84. [ 34%] Building CXX object CMakeFiles/spark.dir/abc_opcodes.cpp.o
  85. /home/jdi/x/src/lightspark-build/abc_opcodes.cpp: In static member function ‘static void lightspark::ABCVm::getLex(lightspark::call_context*, int)’:
  86. /home/jdi/x/src/lightspark-build/abc_opcodes.cpp:1326:12: warning: ‘o’ may be used uninitialized in this function
  87. [ 37%] Building CXX object CMakeFiles/spark.dir/flashdisplay.cpp.o
  88. [ 39%] Building CXX object CMakeFiles/spark.dir/flashevents.cpp.o                                                            
  89. [ 41%] Building CXX object CMakeFiles/spark.dir/textfile.cpp.o                                                                
  90. [ 44%] Building CXX object CMakeFiles/spark.dir/thread_pool.cpp.o                                                            
  91. [ 46%] Building CXX object CMakeFiles/spark.dir/flashgeom.cpp.o                                                              
  92. [ 48%] Building CXX object CMakeFiles/spark.dir/flashnet.cpp.o                                                                
  93. [ 51%] Building CXX object CMakeFiles/spark.dir/flashsystem.cpp.o                                                            
  94. [ 53%] Building CXX object CMakeFiles/spark.dir/flashutils.cpp.o                                                              
  95. [ 55%] Building CXX object CMakeFiles/spark.dir/compat.cpp.o                                                                  
  96. [ 58%] Building CXX object CMakeFiles/spark.dir/abc_interpreter.cpp.o                                                        
  97. [ 60%] Building CXX object CMakeFiles/spark.dir/flashexternal.cpp.o                                                          
  98. [ 62%] Building CXX object CMakeFiles/spark.dir/flashtext.cpp.o                                                              
  99. [ 65%] Building CXX object CMakeFiles/spark.dir/flashmedia.cpp.o                                                              
  100. [ 67%] Building CXX object CMakeFiles/spark.dir/flv.cpp.o                                                                    
  101. /home/jdi/x/src/lightspark-build/flv.cpp: In constructor ‘lightspark::ScriptECMAArray::ScriptECMAArray(std::istream&)’:      
  102. /home/jdi/x/src/lightspark-build/flv.cpp:152:47: warning: dereferencing type-punned pointer will break strict-aliasing rules
  103. [ 69%] Building CXX object CMakeFiles/spark.dir/netutils.cpp.o
  104. [ 72%] Building CXX object CMakeFiles/spark.dir/timer.cpp.o                                                                  
  105. [ 74%] Building CXX object CMakeFiles/spark.dir/decoder.cpp.o                                                                
  106. /home/jdi/x/src/lightspark-build/decoder.cpp: In member function ‘virtual bool lightspark::FFMpegVideoDecoder::decodeData(uint8_t*, uint32_t)’:
  107. /home/jdi/x/src/lightspark-build/decoder.cpp:110:2: warning: ‘int avcodec_decode_video(AVCodecContext*, AVFrame*, int*, const uint8_t*, int)’ is deprecated (declared at /usr/include/libavcodec/avcodec.h:3476)
  108. /home/jdi/x/src/lightspark-build/decoder.cpp:110:69: warning: ‘int avcodec_decode_video(AVCodecContext*, AVFrame*, int*, const uint8_t*, int)’ is deprecated (declared at /usr/include/libavcodec/avcodec.h:3476)
  109. /home/jdi/x/src/lightspark-build/decoder.cpp:117:2: warning: comparison between signed and unsigned integer expressions
  110. /home/jdi/x/src/lightspark-build/decoder.cpp: In member function ‘virtual bool lightspark::FFMpegAudioDecoder::decodeData(uint8_t*, uint32_t)’:
  111. /home/jdi/x/src/lightspark-build/decoder.cpp:248:15: warning: ‘int avcodec_decode_audio2(AVCodecContext*, int16_t*, int*, const uint8_t*, int)’ is deprecated (declared at /usr/include/libavcodec/avcodec.h:3414)
  112. /home/jdi/x/src/lightspark-build/decoder.cpp:248:90: warning: ‘int avcodec_decode_audio2(AVCodecContext*, int16_t*, int*, const uint8_t*, int)’ is deprecated (declared at /usr/include/libavcodec/avcodec.h:3414)
  113. [ 76%] Building CXX object CMakeFiles/spark.dir/threading.cpp.o
  114. [ 79%] Building CXX object CMakeFiles/spark.dir/flashxml.cpp.o                                                                
  115. [ 81%] Building CXX object CMakeFiles/spark.dir/graphics.cpp.o                                                                
  116. [ 83%] Building CXX object CMakeFiles/spark.dir/sound.cpp.o                                                                  
  117. [ 86%] Building ASM-NASM object CMakeFiles/spark.dir/fastpaths_32.asm.o                                                      
  118. Linking CXX shared library liblightspark.so                                                                                  
  119. [ 86%] Built target spark                                                                                                    
  120. Scanning dependencies of target lightspark
  121. [ 88%] Building CXX object CMakeFiles/lightspark.dir/main.cpp.o                                                              
  122. Linking CXX executable lightspark                                                                                            
  123. /usr/bin/ld: cannot find -lLLVMLinker                                                                                        
  124. collect2: ld returned 1 exit status
  125. make[2]: *** [lightspark] Error 1
  126. make[1]: *** [CMakeFiles/lightspark.dir/all] Error 2
  127. make: *** [all] Error 2